BDBM439091 US10604502, Ex # 79
SMILES Cc1cc2n(cc(-c3cncc(N)c3Cl)c2cc1C#N)-c1ccc(cc1)S(N)(=O)=O
InChI Key InChIKey=IVGXAORUPFBHLC-UHFFFAOYSA-N
Data  1 IC50
  Tab Delimited (TSV)   2D SDfile   Computed 3D by Vconf -m prep SDfile
Find this compound or compounds like it in BindingDB:
Activity Spreadsheet -- Enzyme Inhibition Constant Data from BindingDB
Found 1 hit for monomerid = 439091
TargetLysine-specific histone demethylase 1A(Homo sapiens (Human))
Novartis
US Patent
LigandPNGBDBM439091(US10604502, Ex # 79)
Affinity DataIC50:  6nM. Assay description: Representative compounds of the present invention were serially and separately diluted 3-fold in DMSO to obtain a total of twelve concentrations. The...
Ligand InfoPC cidPC sid
In DepthDetails US Patent