BDBM439119 US10604502, Ex # 107
SMILES Cc1cc2n(cc(-c3cnc(Br)c(N)c3Cl)c2cc1C#N)[C@H]1CC[C@H](O)CC1
InChI Key InChIKey=SSPKZNOOUWMYJZ-HDJSIYSDSA-N
Data  1 IC50
  Tab Delimited (TSV)   2D SDfile   Computed 3D by Vconf -m prep SDfile
Find this compound or compounds like it in BindingDB:
Activity Spreadsheet -- Enzyme Inhibition Constant Data from BindingDB
Found 1 hit for monomerid = 439119
TargetLysine-specific histone demethylase 1A(Homo sapiens (Human))
Novartis
US Patent
LigandPNGBDBM439119(US10604502, Ex # 107)
Affinity DataIC50:  9.62E+3nM. Assay description: Representative compounds of the present invention were serially and separately diluted 3-fold in DMSO to obtain a total of twelve concentrations. The...
Ligand InfoPC cidPC sid
In DepthDetails US Patent