BDBM43920 MLS000032522::N-[1-(2-Methoxy-phenyl)-1H-benzoimidazol-5-yl]-benzenesulfonamide::N-[1-(2-methoxyphenyl)-5-benzimidazolyl]benzenesulfonamide::N-[1-(2-methoxyphenyl)benzimidazol-5-yl]benzenesulfonamide::SMR000013142::cid_650152
SMILES COc1ccccc1-n1cnc2cc(NS(=O)(=O)c3ccccc3)ccc12
InChI Key InChIKey=MAXKXFCAXVTFOH-UHFFFAOYSA-N
Data  1 IC50  2 EC50
  Tab Delimited (TSV)   2D SDfile   Computed 3D by Vconf -m prep SDfile
Find this compound or compounds like it in BindingDB:
Activity Spreadsheet -- Enzyme Inhibition Constant Data from BindingDB
Found 3 hits for monomerid = 43920
TargetSolute carrier family 12 member 5(Homo sapiens (Human))
Vanderbilt Screening Center For Gpcrs, Ion Channels And Transporters
Curated by PubChem BioAssay
LigandPNGBDBM43920(MLS000032522 | N-[1-(2-Methoxy-phenyl)-1H-benzoimi...)
Affinity DataEC50:  1.90E+3nM. Assay description: Vanderbilt Screening Center for GPCRs, Ion Channels and Transporters Assay Provider: Eric Delpire Assay Provider Affliation: Vanderbilt University Gr...
In DepthDetails PCBioAssay
TargetKallikrein-5(Homo sapiens (Human))
Pcmd
Curated by PubChem BioAssay
LigandPNGBDBM43920(MLS000032522 | N-[1-(2-Methoxy-phenyl)-1H-benzoimi...)
Affinity DataIC50:  5.00E+4nM. Assay description: Molecular Library Screening Center Network (MLSCN) Penn Center for Molecular Discovery (PCMD) Assay Provider: Scott L. Diamond, University of Pennsy...
In DepthDetails PCBioAssay
TargetSolute carrier family 12 member 5(Homo sapiens (Human))
Vanderbilt Screening Center For Gpcrs, Ion Channels And Transporters
Curated by PubChem BioAssay
LigandPNGBDBM43920(MLS000032522 | N-[1-(2-Methoxy-phenyl)-1H-benzoimi...)
Affinity DataEC50:  1.01E+5nM. Assay description: Vanderbilt Screening Center for GPCRs, Ion Channels and Transporters Assay Provider: Eric Delpire Assay Provider Affliation: Vanderbilt University Gr...
In DepthDetails PCBioAssay