BDBM439203 US10604534, Example 6
SMILES C[C@H]1C[C@@H]2[C@](CO1)(NC(=N)N(C)S2(=O)=O)c1cc(Oc2cc(F)cnc2F)ccc1F
InChI Key InChIKey=FIAQQUCFFLBBCW-INZKUCGCSA-N
Data  2 KI
  Tab Delimited (TSV)   2D SDfile   Computed 3D by Vconf -m prep SDfile
Find this compound or compounds like it in BindingDB:
Activity Spreadsheet -- Enzyme Inhibition Constant Data from BindingDB
Found 2 hits for monomerid = 439203
TargetBeta-secretase 1(Homo sapiens (Human))
Merck Sharp & Dohme
US Patent
LigandPNGBDBM439203(US10604534, Example 6)
Affinity DataKi:  7.10nM. Assay description: BACE1: Reagents: Na+-Acetate pH 5.0; 1% Brij-35; Glycerol; Dimethyl Sulfoxide (DMSO); Recombinant human soluble BACE1 catalytic domain (>95% pure); A...
Ligand InfoPC cidPC sid
In DepthDetails US Patent
TargetBeta-secretase 2(Homo sapiens (Human))
Merck Sharp & Dohme
US Patent
LigandPNGBDBM439203(US10604534, Example 6)
Affinity DataKi:  15nM. Assay description: BACE-2: Inhibitor IC50s at purified human autoBACE-2 are determined in a time-resolved endpoint proteolysis assay that measures hydrolysis of the QSY...
Ligand InfoPC cidPC sid
In DepthDetails US Patent