BDBM439319 US10633348, Compound (A-15)
SMILES CCN1CCN(Cc2ccc(NC(=O)c3ccc(C)c(Oc4ccnc(Nc5cnoc5)n4)c3)cc2C(F)(F)F)CC1
InChI Key InChIKey=BMPXPANSAQOTAY-UHFFFAOYSA-N
Data  2 IC50
  Tab Delimited (TSV)   2D SDfile   Computed 3D by Vconf -m prep SDfile
Find this compound or compounds like it in BindingDB:
Activity Spreadsheet -- Enzyme Inhibition Constant Data from BindingDB
Found 2 hits for monomerid = 439319
TargetNuclear receptor subfamily 2 group C member 2(Homo sapiens (Human))
Dana-Farber Cancer Institute
US Patent
LigandPNGBDBM439319(US10633348, Compound (A-15))
Affinity DataIC50:  136nM. Assay description: The in vitro activity of the compounds described herein in inhibiting TAK1, HCK and other kinases were obtained using an Invitrogen Select Screening ...
Ligand InfoPC cidPC sid
In DepthDetails US Patent
TargetTyrosine-protein kinase HCK(Homo sapiens (Human))
Dana-Farber Cancer Institute
US Patent
LigandPNGBDBM439319(US10633348, Compound (A-15))
Affinity DataIC50:  116nM. Assay description: The in vitro activity of the compounds described herein in inhibiting TAK1, HCK and other kinases were obtained using an Invitrogen Select Screening ...
Ligand InfoPC cidPC sid
In DepthDetails US Patent