BDBM439326 (R)-4-(2-(4-(2-acetyl-5-chlorophenyl)-5-methoxy-2-oxopyridin-1(2H)-yl)-3-phenylpropanamido)benzoic acid::US10633375, Compound No. 180::US10633375, Compound No. 6::US11084808, Compound 180
SMILES COc1cn([C@H](Cc2ccccc2)C(=O)Nc2ccc(cc2)C(O)=O)c(=O)cc1-c1cc(Cl)ccc1C(C)=O
InChI Key InChIKey=JNXPWRQGIIYFNI-AREMUKBSSA-N
Data  4 IC50
  Tab Delimited (TSV)   2D SDfile   Computed 3D by Vconf -m prep SDfile
Find this compound or compounds like it in BindingDB:
Activity Spreadsheet -- Enzyme Inhibition Constant Data from BindingDB
Found 4 hits for monomerid = 439326
TargetCoagulation factor XI(Homo sapiens (Human))
Jinagsu Hengrui Medicine
US Patent
LigandPNGBDBM439326((R)-4-(2-(4-(2-acetyl-5-chlorophenyl)-5-methoxy-2-...)
Affinity DataIC50:  1.82E+3nM. Assay description: Test Example 1: Biological Activity of the Compounds of the Present Invention onThe Inhibition of Factor XIa Detected by Absorption Photometry1. Expe...
Ligand InfoPC cidPC sid
In DepthDetails US Patent
TargetCoagulation factor XI(Homo sapiens (Human))
Jinagsu Hengrui Medicine
US Patent
LigandPNGBDBM439326((R)-4-(2-(4-(2-acetyl-5-chlorophenyl)-5-methoxy-2-...)
Affinity DataIC50:  1.82E+3nM. Assay description: 1. Experimental MaterialsEnzyme: Coagulation Factor XIa protease (Abcam, Art. No ab62411)Substrate: Coagulation Factor XIa specific substrate (HYPHEN...
Ligand InfoPC cidPC sid
In DepthDetails US Patent
TargetCoagulation factor XI(Homo sapiens (Human))
Jinagsu Hengrui Medicine
US Patent
LigandPNGBDBM439326((R)-4-(2-(4-(2-acetyl-5-chlorophenyl)-5-methoxy-2-...)
Affinity DataIC50:  4.83E+3nM. Assay description: 1. Experimental MaterialsEnzyme: Coagulation Factor XIa protease (Abcam, Art. No ab62411)Substrate: Coagulation Factor XIa specific substrate (HYPHEN...
Ligand InfoPC cidPC sid
In DepthDetails US Patent
TargetCoagulation factor XI(Homo sapiens (Human))
Jinagsu Hengrui Medicine
US Patent
LigandPNGBDBM439326((R)-4-(2-(4-(2-acetyl-5-chlorophenyl)-5-methoxy-2-...)
Affinity DataIC50:  4.83E+3nM. Assay description: Test Example 1: Biological Activity of the Compounds of the Present Invention onThe Inhibition of Factor XIa Detected by Absorption Photometry1. Expe...
Ligand InfoPC cidPC sid
In DepthDetails US Patent