BDBM439435 4-(2-(4-(2-acetyl-5-chlorophenyl)-5-methoxy-2-oxopyridin-1(2H)-yl)hexanamido)benzoic acid::US10633375, Compound No. 155::US11084808, Compound 155
SMILES CCCCC(C(=O)Nc1ccc(cc1)C(O)=O)n1cc(OC)c(cc1=O)-c1cc(Cl)ccc1C(C)=O
InChI Key InChIKey=ZIFDBZAYYZNYOH-UHFFFAOYSA-N
Data  2 IC50
  Tab Delimited (TSV)   2D SDfile   Computed 3D by Vconf -m prep SDfile
Find this compound or compounds like it in BindingDB:
Activity Spreadsheet -- Enzyme Inhibition Constant Data from BindingDB
Found 2 hits for monomerid = 439435
TargetCoagulation factor XI(Homo sapiens (Human))
Jiangsu Hengrui Medicine
US Patent
LigandPNGBDBM439435(4-(2-(4-(2-acetyl-5-chlorophenyl)-5-methoxy-2-oxop...)
Affinity DataIC50:  81nM. Assay description: 1. Experimental MaterialsEnzyme: Coagulation Factor XIa protease (Abcam, Art. No ab62411)Substrate: Coagulation Factor XIa specific substrate (HYPHEN...
Ligand InfoPC cidPC sid
In DepthDetails US Patent
TargetCoagulation factor XI(Homo sapiens (Human))
Jiangsu Hengrui Medicine
US Patent
LigandPNGBDBM439435(4-(2-(4-(2-acetyl-5-chlorophenyl)-5-methoxy-2-oxop...)
Affinity DataIC50:  81nM. Assay description: Test Example 1: Biological Activity of the Compounds of the Present Invention onThe Inhibition of Factor XIa Detected by Absorption Photometry1. Expe...
Ligand InfoPC cidPC sid
In DepthDetails US Patent