BDBM439527 US10633379, Example 63
SMILES Cc1cccc(Cl)c1Oc1ncc(cc1-c1cn(C)c(=O)c2[nH]c(cc12)C(=O)NC12CC(C1)C2)C(C)(C)O
InChI Key InChIKey=SFHDZVYTUSCKSK-UHFFFAOYSA-N
Data  2 KI
  Tab Delimited (TSV)   2D SDfile   Computed 3D by Vconf -m prep SDfile
Find this compound or compounds like it in BindingDB:
Activity Spreadsheet -- Enzyme Inhibition Constant Data from BindingDB
Found 2 hits for monomerid = 439527
TargetBromodomain-containing protein 4 [352-457](Homo sapiens (Human))
Abbvie
US Patent
LigandPNGBDBM439527(US10633379, Example 63)
Affinity DataKi:  1.5nM. Assay description: Compound dilution series were prepared in DMSO via an approximately 3-fold serial dilution. Compound dilutions were added directly into white, low-vo...
Ligand InfoPC cidPC sid
In DepthDetails US Patent
TargetBromodomain-containing protein 4 [57-168](Homo sapiens (Human))
Abbvie
US Patent
LigandPNGBDBM439527(US10633379, Example 63)
Affinity DataKi:  406nM. Assay description: Compound dilution series were prepared in DMSO via an approximately 3-fold serial dilution. Compound dilutions were added directly into white, low-vo...
Ligand InfoPC cidPC sid
In DepthDetails US Patent