BDBM439529 US10633379, Example 65
SMILES CCNC(=O)c1cc2c(cn(C)c(=O)c2[nH]1)-c1cc(c(F)cc1Oc1c(C)cc(F)cc1C)C(C)(C)O
InChI Key InChIKey=GXQVGFLKXBYKFB-UHFFFAOYSA-N
Data  2 KI
  Tab Delimited (TSV)   2D SDfile   Computed 3D by Vconf -m prep SDfile
Find this compound or compounds like it in BindingDB:
Activity Spreadsheet -- Enzyme Inhibition Constant Data from BindingDB
Found 2 hits for monomerid = 439529
TargetBromodomain-containing protein 4 [352-457](Homo sapiens (Human))
Abbvie
US Patent
LigandPNGBDBM439529(US10633379, Example 65)
Affinity DataKi:  1.30nM. Assay description: Compound dilution series were prepared in DMSO via an approximately 3-fold serial dilution. Compound dilutions were added directly into white, low-vo...
Ligand InfoPC cidPC sid
In DepthDetails US Patent
TargetBromodomain-containing protein 4 [57-168](Homo sapiens (Human))
Abbvie
US Patent
LigandPNGBDBM439529(US10633379, Example 65)
Affinity DataKi:  222nM. Assay description: Compound dilution series were prepared in DMSO via an approximately 3-fold serial dilution. Compound dilutions were added directly into white, low-vo...
Ligand InfoPC cidPC sid
In DepthDetails US Patent