BDBM43998 3-[5-[(E)-(2,5-diketo-1-phenyl-imidazolidin-4-ylidene)methyl]-2-furyl]-4-methyl-benzoic acid::3-[5-[(E)-(2,5-dioxo-1-phenyl-4-imidazolidinylidene)methyl]-2-furanyl]-4-methylbenzoic acid::3-[5-[(E)-(2,5-dioxo-1-phenylimidazolidin-4-ylidene)methyl]furan-2-yl]-4-methylbenzoic acid::3-[5-[(E)-[2,5-bis(oxidanylidene)-1-phenyl-imidazolidin-4-ylidene]methyl]furan-2-yl]-4-methyl-benzoic acid::3-{5-[(2,5-dioxo-1-phenyl-4-imidazolidinylidene)methyl]-2-furyl}-4-methylbenzoic acid::MLS000530602::SMR000135580::cid_5735947
SMILES Cc1ccc(cc1-c1ccc(C=C2NC(=O)N(C2=O)c2ccccc2)o1)C(O)=O
InChI Key InChIKey=UDLFNRJYXKFBGE-UHFFFAOYSA-N
Data  5 IC50  2 EC50
  Tab Delimited (TSV)   2D SDfile   Computed 3D by Vconf -m prep SDfile
Find this compound or compounds like it in BindingDB:
Activity Spreadsheet -- Enzyme Inhibition Constant Data from BindingDB
Found 7 hits for monomerid = 43998
TargetSolute carrier family 12 member 5(Homo sapiens (Human))
Vanderbilt Screening Center For Gpcrs, Ion Channels And Transporters
Curated by PubChem BioAssay
LigandPNGBDBM43998(3-[5-[(E)-(2,5-diketo-1-phenyl-imidazolidin-4-ylid...)
Affinity DataEC50:  1.48E+4nM. Assay description: Vanderbilt Screening Center for GPCRs, Ion Channels and Transporters Assay Provider: Eric Delpire Assay Provider Affliation: Vanderbilt University Gr...
In DepthDetails PCBioAssay
TargetEstrogen receptor beta(Homo sapiens (Human))
Emory University
Curated by PubChem BioAssay
LigandPNGBDBM43998(3-[5-[(E)-(2,5-diketo-1-phenyl-imidazolidin-4-ylid...)
Affinity DataIC50:  5.00E+4nM. Assay description: NIH Molecular Libraries Screening Centers Network [MLSCN] Emory Chemical Biology Discovery Center in MLSCN Assay provider: John A. Katzenellenbogen, ...
In DepthDetails PCBioAssay
TargetSolute carrier family 12 member 5(Homo sapiens (Human))
Vanderbilt Screening Center For Gpcrs, Ion Channels And Transporters
Curated by PubChem BioAssay
LigandPNGBDBM43998(3-[5-[(E)-(2,5-diketo-1-phenyl-imidazolidin-4-ylid...)
Affinity DataEC50:  1.07E+4nM. Assay description: Vanderbilt Screening Center for GPCRs, Ion Channels and Transporters Assay Provider: Eric Delpire Assay Provider Affliation: Vanderbilt University Gr...
In DepthDetails PCBioAssay
Target26S proteasome non-ATPase regulatory subunit 14(Homo sapiens (Human))
Burnham Center For Chemical Genomics
Curated by PubChem BioAssay
LigandPNGBDBM43998(3-[5-[(E)-(2,5-diketo-1-phenyl-imidazolidin-4-ylid...)
Affinity DataIC50:  1.63E+4nM. Assay description: Data Source: Sanford-Burnham Center for Chemical Genomics (SBCCG) Source Affiliation: Sanford Burnham Medical Research Institute (SBMRI, La Jolla, CA...
In DepthDetails PCBioAssay
TargetProthrombin(Bos taurus (Bovine))
Burnham Center For Chemical Genomics
Curated by PubChem BioAssay
LigandPNGBDBM43998(3-[5-[(E)-(2,5-diketo-1-phenyl-imidazolidin-4-ylid...)
Affinity DataIC50:  3.39E+4nM. Assay description: Data Source: Sanford-Burnham Center for Chemical Genomics (SBCCG) Source Affiliation: Sanford Burnham Medical Research Institute (SBMRI, La Jolla, CA...
In DepthDetails PCBioAssay
TargetDNA (cytosine-5)-methyltransferase 1(Homo sapiens (Human))
Burnham Center For Chemical Genomics
Curated by PubChem BioAssay
LigandPNGBDBM43998(3-[5-[(E)-(2,5-diketo-1-phenyl-imidazolidin-4-ylid...)
Affinity DataIC50:  1.10E+4nM. Assay description: Data Source: Sanford-Burnham Center for Chemical Genomics (SBCCG) Source Affiliation: Sanford-Burnham Medical Research Institute (SBMRI, San Diego, C...
In DepthDetails PCBioAssay
TargetCarboxy-terminal domain RNA polymerase II polypeptide A small phosphatase 1(Homo sapiens (Human))
Burnham Center For Chemical Genomics
Curated by PubChem BioAssay
LigandPNGBDBM43998(3-[5-[(E)-(2,5-diketo-1-phenyl-imidazolidin-4-ylid...)
Affinity DataIC50:  4.10E+3nM. Assay description: Data Source: Sanford-Burnham Center for Chemical Genomics (SBCCG) Source Affiliation: Sanford-Burnham Medical Research Institute (SBMRI, San Diego, C...
In DepthDetails PCBioAssay