BDBM44010 7-[[5-(4-methoxyanilino)-1,3,4-thiadiazol-2-yl]sulfanylmethyl]-[1,3]thiazolo[3,2-a]pyrimidin-5-one::7-[[5-[(4-methoxyphenyl)amino]-1,3,4-thiadiazol-2-yl]sulfanylmethyl]-[1,3]thiazolo[3,2-a]pyrimidin-5-one::7-[[[5-(4-methoxyanilino)-1,3,4-thiadiazol-2-yl]thio]methyl]-5-thiazolo[3,2-a]pyrimidinone::7-[[[5-(p-anisidino)-1,3,4-thiadiazol-2-yl]thio]methyl]thiazolo[3,2-a]pyrimidin-5-one::MLS000565720::SMR000152806::cid_2420449
SMILES COc1ccc(Nc2nnc(SCc3cc(=O)n4ccsc4n3)s2)cc1
InChI Key InChIKey=LCAIZWIWQYNTPD-UHFFFAOYSA-N
Data  5 IC50  1 EC50
  Tab Delimited (TSV)   2D SDfile   Computed 3D by Vconf -m prep SDfile
Find this compound or compounds like it in BindingDB:
Activity Spreadsheet -- Enzyme Inhibition Constant Data from BindingDB
Found 6 hits for monomerid = 44010
TargetSolute carrier family 12 member 5(Homo sapiens (Human))
Vanderbilt Screening Center For Gpcrs, Ion Channels And Transporters
Curated by PubChem BioAssay
LigandPNGBDBM44010(7-[[5-(4-methoxyanilino)-1,3,4-thiadiazol-2-yl]sul...)
Affinity DataEC50:  8.87E+6nM. Assay description: Vanderbilt Screening Center for GPCRs, Ion Channels and Transporters Assay Provider: Eric Delpire Assay Provider Affliation: Vanderbilt University Gr...
In DepthDetails PCBioAssay
TargetEstrogen receptor beta(Homo sapiens (Human))
Emory University
Curated by PubChem BioAssay
LigandPNGBDBM44010(7-[[5-(4-methoxyanilino)-1,3,4-thiadiazol-2-yl]sul...)
Affinity DataIC50:  5.00E+4nM. Assay description: NIH Molecular Libraries Screening Centers Network [MLSCN] Emory Chemical Biology Discovery Center in MLSCN Assay provider: John A. Katzenellenbogen, ...
In DepthDetails PCBioAssay
TargetSentrin-specific protease 1(Homo sapiens (Human))
Burnham Center For Chemical Genomics
Curated by PubChem BioAssay
LigandPNGBDBM44010(7-[[5-(4-methoxyanilino)-1,3,4-thiadiazol-2-yl]sul...)
Affinity DataIC50:  2.62E+4nM
In DepthDetails PCBioAssay
TargetFemale germline-specific tumor suppressor gld-1(Caenorhabditis elegans)
The Scripps Research Institute Molecular Screening Center
Curated by PubChem BioAssay
LigandPNGBDBM44010(7-[[5-(4-methoxyanilino)-1,3,4-thiadiazol-2-yl]sul...)
Affinity DataIC50:  4.55E+4nM. Assay description: Source (MLPCN Center Name): The Scripps Research Institute Molecular Screening Center (SRIMSC) Affiliation: The Scripps Research Institute, TSRI Assa...
In DepthDetails PCBioAssay
TargetSentrin-specific protease 1(Homo sapiens (Human))
Burnham Center For Chemical Genomics
Curated by PubChem BioAssay
LigandPNGBDBM44010(7-[[5-(4-methoxyanilino)-1,3,4-thiadiazol-2-yl]sul...)
Affinity DataIC50:  1.63E+4nM
In DepthDetails PCBioAssay
TargetProtein Rev(Human immunodeficiency virus 1)
The Scripps Research Institute Molecular Screening Center
Curated by PubChem BioAssay
LigandPNGBDBM44010(7-[[5-(4-methoxyanilino)-1,3,4-thiadiazol-2-yl]sul...)
Affinity DataIC50: >7.54E+4nM. Assay description: Source (MLPCN Center Name): The Scripps Research Institute Molecular Screening Center (SRIMSC) Affiliation: The Scripps Research Institute, TSRI Assa...
In DepthDetails PCBioAssay