BDBM440570 US10633389, Example 236-3::US10633389, Example 237-3::US20230279020, Example 237-3
SMILES CNC[C@@H](O)COc1ccc(Cl)c(c1)-c1nc(N2Cc3c(C)nn(C)c3C2)c(C)c(n1)-c1c(C)noc1C
InChI Key InChIKey=FIJDNUJRXNDTND-GOSISDBHSA-N
Data  4 IC50
  Tab Delimited (TSV)   2D SDfile   Computed 3D by Vconf -m prep SDfile
Find this compound or compounds like it in BindingDB:
Activity Spreadsheet -- Enzyme Inhibition Constant Data from BindingDB
Found 4 hits for monomerid = 440570
TargetHistone-arginine methyltransferase CARM1(Homo sapiens (Human))
Epizyme
US Patent
LigandPNGBDBM440570(US10633389, Example 236-3 | US10633389, Example 23...)
Affinity DataIC50: <100nM. Assay description: The assays were all performed in a buffer consisting of 20 mM Bicine (pH=7.6), 1 mM TCEP, 0.005% BSG, and 0.002% Tween 20, prepared on the day of use...
Ligand InfoPC cidPC sid
In DepthDetails US Patent
TargetHistone-arginine methyltransferase CARM1(Homo sapiens (Human))
Epizyme
US Patent
LigandPNGBDBM440570(US10633389, Example 236-3 | US10633389, Example 23...)
Affinity DataIC50: <100nM. Assay description: The assays were all performed in a buffer consisting of 20 mM Bicine (pH=7.6), 1 mM TCEP, 0.005% BSG, and 0.002% Tween 20, prepared on the day of use...
Ligand InfoPC cidPC sid
In DepthDetails US Patent
TargetHistone-arginine methyltransferase CARM1(Homo sapiens (Human))
Epizyme
US Patent
LigandPNGBDBM440570(US10633389, Example 236-3 | US10633389, Example 23...)
Affinity DataIC50: <100nM. Assay description: The assays were all performed in a buffer consisting of 20 mM Bicine (pH=7.6), 1 mM TCEP, 0.005% BSG, and 0.002% Tween 20, prepared on the day of use...
Ligand InfoPC cidPC sid
In DepthDetails US Patent
TargetHistone-arginine methyltransferase CARM1(Homo sapiens (Human))
Epizyme
US Patent
LigandPNGBDBM440570(US10633389, Example 236-3 | US10633389, Example 23...)
Affinity DataIC50: <100nM. Assay description: The assays were all performed in a buffer consisting of 20 mM Bicine (pH=7.6), 1 mM TCEP, 0.005% BSG, and 0.002% Tween 20, prepared on the day of use...
Ligand InfoPC cidPC sid
In DepthDetails US Patent