BDBM440760 US10639284, Compound 2.107::US11426364, Compound 2.107
SMILES COc1cccc(c1F)-c1cccc2[C@H](CCc12)Oc1cc(OCc2cncc(c2)C#N)c(CN[C@H](CO)C(O)=O)cc1Cl
InChI Key InChIKey=NNUHHXUNYQNSTA-IZLXSDGUSA-N
Data  2 IC50
  Tab Delimited (TSV)   2D SDfile   Computed 3D by Vconf -m prep SDfile
Find this compound or compounds like it in BindingDB:
Activity Spreadsheet -- Enzyme Inhibition Constant Data from BindingDB
Found 2 hits for monomerid = 440760
TargetProgrammed cell death 1 ligand 1(Homo sapiens (Human))
Chemocentryx
US Patent
LigandPNGBDBM440760(US10639284, Compound 2.107 | US11426364, Compound ...)
Affinity DataIC50: <100nM. Assay description: Plates were coated with 1 μg/mL of human PD-L1 (obtained from R&D) in PBS overnight at 4° C. The wells were then blocked with PBS containing 2% ...
Ligand InfoPC cidPC sid
In DepthDetails US Patent
TargetProgrammed cell death 1 ligand 1(Homo sapiens (Human))
Chemocentryx
US Patent
LigandPNGBDBM440760(US10639284, Compound 2.107 | US11426364, Compound ...)
Affinity DataIC50: <100nM. Assay description: Plates were coated with 1 μg/mL of human PD-L1 (obtained from R&D) in PBS overnight at 4° C. The wells were then blocked with PBS containing 2% BSA...
Ligand InfoPC cidPC sid
In DepthDetails US Patent