BDBM440817 US10639284, Compound 2.164::US11426364, Compound 2.164
SMILES CCOc1cc(O[C@H]2CCc3c2cccc3-c2ccccc2F)c(Cl)cc1CNC(CO)(CO)CO
InChI Key InChIKey=KBJDCJBDDHNDON-VWLOTQADSA-N
Data  2 IC50
  Tab Delimited (TSV)   2D SDfile   Computed 3D by Vconf -m prep SDfile
Find this compound or compounds like it in BindingDB:
Activity Spreadsheet -- Enzyme Inhibition Constant Data from BindingDB
Found 2 hits for monomerid = 440817
TargetProgrammed cell death 1 ligand 1(Homo sapiens (Human))
Chemocentryx
US Patent
LigandPNGBDBM440817(US10639284, Compound 2.164 | US11426364, Compound ...)
Affinity DataIC50: <100nM. Assay description: Plates were coated with 1 μg/mL of human PD-L1 (obtained from R&D) in PBS overnight at 4° C. The wells were then blocked with PBS containing 2% ...
Ligand InfoPC cidPC sid
In DepthDetails US Patent
TargetProgrammed cell death 1 ligand 1(Homo sapiens (Human))
Chemocentryx
US Patent
LigandPNGBDBM440817(US10639284, Compound 2.164 | US11426364, Compound ...)
Affinity DataIC50: <100nM. Assay description: Plates were coated with 1 μg/mL of human PD-L1 (obtained from R&D) in PBS overnight at 4° C. The wells were then blocked with PBS containing 2% BSA...
Ligand InfoPC cidPC sid
In DepthDetails US Patent