BDBM440975 US10640486, Example 9
SMILES Nc1ccc2C(CCc2n1)NC(=O)c1cn(Cc2ccc(cc2)N2CCN3CCCCC3C2=O)nn1
InChI Key InChIKey=YONRNOGERAUEOK-UHFFFAOYSA-N
Data  1 IC50
  Tab Delimited (TSV)   2D SDfile   Computed 3D by Vconf -m prep SDfile
Find this compound or compounds like it in BindingDB:
Activity Spreadsheet -- Enzyme Inhibition Constant Data from BindingDB
Found 1 hit for monomerid = 440975
TargetTyrosine-protein kinase BTK(Homo sapiens (Human))
Boehringer Ingelheim International
US Patent
LigandPNGBDBM440975(US10640486, Example 9)
Affinity DataIC50:  3.20E+3nM. Assay description: This BTK competition assay measures compound potency (IC50) for the inactivated state of Bruton's Tyrosine Kinase using FRET (Förster/Flouresence...
Ligand InfoPC cidPC sid
In DepthDetails US Patent