BDBM441057 US10640495, Example I-22
SMILES COCCN1C[C@@H](NC(=O)Nc2c(C)c(nn2-c2ccccc2)-c2ccc3n(C)ncc3c2)[C@@H](O1)c1ccc(F)c(F)c1
InChI Key InChIKey=RXSFFZVZXJXPMI-UHSQPCAPSA-N
Data  1 IC50
  Tab Delimited (TSV)   2D SDfile   Computed 3D by Vconf -m prep SDfile
Find this compound or compounds like it in BindingDB:
Activity Spreadsheet -- Enzyme Inhibition Constant Data from BindingDB
Found 1 hit for monomerid = 441057
TargetHigh affinity nerve growth factor receptor(Homo sapiens (Human))
Shionogi
US Patent
LigandPNGBDBM441057(US10640495, Example I-22)
Affinity DataIC50:  0.810nM. Assay description: Seven point five μL per well of human TrkA (PV3144, Lifetechnologies, final concentration: 1 nmol/L) suspended in the assay buffer (100 mmol/L 4...
Ligand InfoPC cidPC sid
In DepthDetails US Patent