BDBM441097 US10640495, Example I-268
SMILES COCCN1C[C@@H](NC(=O)Nc2c(C)c(nn2-c2ccccc2)-c2cnc(N=S(C)(C)=O)nc2)[C@@H](O1)c1ccc(F)c(F)c1
InChI Key InChIKey=VZUHHVKGUJENEZ-RSXGOPAZSA-N
Data  1 IC50
  Tab Delimited (TSV)   2D SDfile   Computed 3D by Vconf -m prep SDfile
Find this compound or compounds like it in BindingDB:
Activity Spreadsheet -- Enzyme Inhibition Constant Data from BindingDB
Found 1 hit for monomerid = 441097
TargetHigh affinity nerve growth factor receptor(Homo sapiens (Human))
Shionogi
US Patent
LigandPNGBDBM441097(US10640495, Example I-268)
Affinity DataIC50:  0.550nM. Assay description: Seven point five μL per well of human TrkA (PV3144, Lifetechnologies, final concentration: 1 nmol/L) suspended in the assay buffer (100 mmol/L 4...
Ligand InfoPC cidPC sid
In DepthDetails US Patent