BDBM441111 US10640495, Example I-319
SMILES CNC(=O)c1cc(cnc1OC)-c1nn(c(NC(=O)N[C@@H]2C[C@@H](CCOC)O[C@H]2c2ccnc(F)c2)c1C)-c1ccccc1
InChI Key InChIKey=WGUVLUIMICJQKE-GYZWWNDVSA-N
Data  1 IC50
  Tab Delimited (TSV)   2D SDfile   Computed 3D by Vconf -m prep SDfile
Find this compound or compounds like it in BindingDB:
Activity Spreadsheet -- Enzyme Inhibition Constant Data from BindingDB
Found 1 hit for monomerid = 441111
TargetHigh affinity nerve growth factor receptor(Homo sapiens (Human))
Shionogi
US Patent
LigandPNGBDBM441111(US10640495, Example I-319)
Affinity DataIC50:  1.20nM. Assay description: Seven point five μL per well of human TrkA (PV3144, Lifetechnologies, final concentration: 1 nmol/L) suspended in the assay buffer (100 mmol/L 4...
Ligand InfoPC cidPC sid
In DepthDetails US Patent