BDBM44148 (E)-4-(1,3-benzothiazol-2-yl)-5-(4-morpholin-4-yl-3-nitro-phenyl)pent-4-enoic acid::(E)-4-(1,3-benzothiazol-2-yl)-5-(4-morpholin-4-yl-3-nitrophenyl)pent-4-enoic acid::(E)-4-(1,3-benzothiazol-2-yl)-5-(4-morpholino-3-nitro-phenyl)pent-4-enoic acid::(E)-4-(1,3-benzothiazol-2-yl)-5-[4-(4-morpholinyl)-3-nitrophenyl]-4-pentenoic acid::MLS000776399::SMR000371378::cid_6519283
SMILES OC(=O)CC\C(=C/c1ccc(N2CCOCC2)c(c1)[N+]([O-])=O)c1nc2ccccc2s1
InChI Key InChIKey=NXNSXGNQXJUFFN-DTQAZKPQSA-N
Data  3 EC50
  Tab Delimited (TSV)   2D SDfile   Computed 3D by Vconf -m prep SDfile
Find this compound or compounds like it in BindingDB:
Activity Spreadsheet -- Enzyme Inhibition Constant Data from BindingDB
Found 3 hits for monomerid = 44148
TargetSolute carrier family 12 member 5(Homo sapiens (Human))
Vanderbilt Screening Center For Gpcrs, Ion Channels And Transporters
Curated by PubChem BioAssay
LigandPNGBDBM44148((E)-4-(1,3-benzothiazol-2-yl)-5-(4-morpholin-4-yl-...)
Affinity DataEC50:  8.21E+7nM. Assay description: Vanderbilt Screening Center for GPCRs, Ion Channels and Transporters Assay Provider: Eric Delpire Assay Provider Affliation: Vanderbilt University Gr...
In DepthDetails PCBioAssay
TargetSolute carrier family 12 member 5(Homo sapiens (Human))
Vanderbilt Screening Center For Gpcrs, Ion Channels And Transporters
Curated by PubChem BioAssay
LigandPNGBDBM44148((E)-4-(1,3-benzothiazol-2-yl)-5-(4-morpholin-4-yl-...)
Affinity DataEC50:  1.22E+4nM. Assay description: Vanderbilt Screening Center for GPCRs, Ion Channels and Transporters Assay Provider: Eric Delpire Assay Provider Affliation: Vanderbilt University Gr...
In DepthDetails PCBioAssay
TargetSolute carrier family 12 member 5(Homo sapiens (Human))
Vanderbilt Screening Center For Gpcrs, Ion Channels And Transporters
Curated by PubChem BioAssay
LigandPNGBDBM44148((E)-4-(1,3-benzothiazol-2-yl)-5-(4-morpholin-4-yl-...)
Affinity DataEC50:  2.66E+3nM. Assay description: Vanderbilt Screening Center for GPCRs, Ion Channels and Transporters Assay Provider: Eric Delpire Assay Provider Affliation: Vanderbilt University Gr...
In DepthDetails PCBioAssay