BDBM441738 US10640498, Example 35
SMILES FC1(CCN(C1)C#N)C(=O)N1CCc2cc(ccc12)-c1ccnn1Cc1ccccc1
InChI Key InChIKey=XJYTYONFGOMBNF-UHFFFAOYSA-N
Data  1 IC50
  Tab Delimited (TSV)   2D SDfile   Computed 3D by Vconf -m prep SDfile
Find this compound or compounds like it in BindingDB:
Activity Spreadsheet -- Enzyme Inhibition Constant Data from BindingDB
Found 1 hit for monomerid = 441738
TargetUbiquitin carboxyl-terminal hydrolase 30(Homo sapiens (Human))
Mission Therapeutics
US Patent
LigandPNGBDBM441738(US10640498, Example 35)
Affinity DataIC50:  5.50E+3nM. Assay description: Dilution plates were prepared at 21 times the final concentration (2100 M for a final concentration of 100 μM) in 50% DMSO in a 96-well polyprop...
Ligand InfoPC cidPC sid
In DepthDetails US Patent