BDBM441787 US10640533, Identification number CX13-605::US10640533, Table 1.34
SMILES C[C@@]1(CO1)C(=O)[C@H](Cc1ccccc1)NC(=O)[C@H](Cc1cscn1)NC(=O)[C@H](CCc1ccccc1)NC(=O)c1cc(CN2CCOCC2)on1
InChI Key InChIKey=IRDZFWJCUCPPGT-CQMLEQORSA-N
Data  6 IC50
  Tab Delimited (TSV)   2D SDfile   Computed 3D by Vconf -m prep SDfile
Find this compound or compounds like it in BindingDB:
Activity Spreadsheet -- Enzyme Inhibition Constant Data from BindingDB
Found 6 hits for monomerid = 441787
TargetChymotrypsin-like protease CTRL-1(Homo sapiens (Human))
Centrax International
US Patent
LigandPNGBDBM441787(US10640533, Identification number CX13-605 | US106...)
Affinity DataIC50:  6.81nM. Assay description: Inhibition of the chymotrypsin-like (CT-L), peptidylglutamyl peptide hydrolyzing activity (PGPH), and trypsin-like (T-L) activities of the 20S protea...
Ligand InfoPC cidPC sid
In DepthDetails US Patent
TargetProteasome subunit beta type-1(Homo sapiens (Human))
Centrax International
US Patent
LigandPNGBDBM441787(US10640533, Identification number CX13-605 | US106...)
Affinity DataIC50: >2.00E+4nM. Assay description: Inhibition of the chymotrypsin-like (CT-L), peptidylglutamyl peptide hydrolyzing activity (PGPH), and trypsin-like (T-L) activities of the 20S protea...
Ligand InfoPC cidPC sid
In DepthDetails US Patent
TargetTransmembrane protease serine 11D(Homo sapiens (Human))
Centrax International
US Patent
LigandPNGBDBM441787(US10640533, Identification number CX13-605 | US106...)
Affinity DataIC50: >2.00E+4nM. Assay description: Inhibition of the chymotrypsin-like (CT-L), peptidylglutamyl peptide hydrolyzing activity (PGPH), and trypsin-like (T-L) activities of the 20S protea...
Ligand InfoPC cidPC sid
In DepthDetails US Patent
TargetChymotrypsin-like protease CTRL-1(Homo sapiens (Human))
Centrax International
US Patent
LigandPNGBDBM441787(US10640533, Identification number CX13-605 | US106...)
Affinity DataIC50:  12.2nM. Assay description: Inhibition of the chymotrypsin-like (CT-L), peptidylglutamyl peptide hydrolyzing activity (PGPH), and trypsin-like (T-L) activities of the 20S protea...
Ligand InfoPC cidPC sid
In DepthDetails US Patent
TargetProteasome subunit beta type-1(Homo sapiens (Human))
Centrax International
US Patent
LigandPNGBDBM441787(US10640533, Identification number CX13-605 | US106...)
Affinity DataIC50: >2.00E+4nM. Assay description: Inhibition of the chymotrypsin-like (CT-L), peptidylglutamyl peptide hydrolyzing activity (PGPH), and trypsin-like (T-L) activities of the 20S protea...
Ligand InfoPC cidPC sid
In DepthDetails US Patent
TargetTransmembrane protease serine 11D(Homo sapiens (Human))
Centrax International
US Patent
LigandPNGBDBM441787(US10640533, Identification number CX13-605 | US106...)
Affinity DataIC50: >2.00E+4nM. Assay description: Inhibition of the chymotrypsin-like (CT-L), peptidylglutamyl peptide hydrolyzing activity (PGPH), and trypsin-like (T-L) activities of the 20S protea...
Ligand InfoPC cidPC sid
In DepthDetails US Patent