BDBM441932 US10647694, Example 20
SMILES CCOc1cc(ccc1Nc1ncc(Cl)c(Nc2ccccc2S(=O)(=O)C(C)C)n1)C1CCNCC1
InChI Key InChIKey=NBJMRYNOJQGYNG-UHFFFAOYSA-N
Data  1 IC50
  Tab Delimited (TSV)   2D SDfile   Computed 3D by Vconf -m prep SDfile
Find this compound or compounds like it in BindingDB:
Activity Spreadsheet -- Enzyme Inhibition Constant Data from BindingDB
Found 1 hit for monomerid = 441932
TargetALK tyrosine kinase receptor(Homo sapiens (Human))
Arromax Pharmatech
US Patent
LigandPNGBDBM441932(US10647694, Example 20)
Affinity DataIC50:  5.5nM. Assay description: The in-vitro kinase assay was performed using the HTRF kinEASE TK kit available from Cisbio. The operation steps are indicated in the instructions of...
Ligand InfoPC cidPC sid
In DepthDetails US Patent