BDBM441956 US10647694, Example 44
SMILES CCc1cc(Nc2ncc(Cl)c(Nc3ccccc3S(=O)(=O)C(C)C)n2)c(OC)cc1C1CCNCC1
InChI Key InChIKey=JOZIDEKJJPIFJE-UHFFFAOYSA-N
Data  1 IC50
  Tab Delimited (TSV)   2D SDfile   Computed 3D by Vconf -m prep SDfile
Find this compound or compounds like it in BindingDB:
Activity Spreadsheet -- Enzyme Inhibition Constant Data from BindingDB
Found 1 hit for monomerid = 441956
TargetALK tyrosine kinase receptor(Homo sapiens (Human))
Arromax Pharmatech
US Patent
LigandPNGBDBM441956(US10647694, Example 44)
Affinity DataIC50:  55nM. Assay description: The in-vitro kinase assay was performed using the HTRF kinEASE TK kit available from Cisbio. The operation steps are indicated in the instructions of...
Ligand InfoPC cidPC sid
In DepthDetails US Patent