BDBM442020 US10647708, Compound 10
SMILES Cc1nonc1COc1ccc(cc1)C(=O)NCCC(O)CN1CCc2ccccc2C1
InChI Key InChIKey=MSJCISJIROKNQN-UHFFFAOYSA-N
Data  1 IC50
  Tab Delimited (TSV)   2D SDfile   Computed 3D by Vconf -m prep SDfile
Find this compound or compounds like it in BindingDB:
Activity Spreadsheet -- Enzyme Inhibition Constant Data from BindingDB
Found 1 hit for monomerid = 442020
TargetProtein arginine N-methyltransferase 5(Homo sapiens (Human))
Ctxt
US Patent
LigandPNGBDBM442020(US10647708, Compound 10)
Affinity DataIC50:  3.98E+3nM. Assay description: Full-length PRMT5 enzyme (NCBI Reference sequence NP_006100.2) was co-expressed with Hiss-MEP50 in insect cells and purified via Nickel immobilized m...
Ligand InfoPC cidPC sid
In DepthDetails US Patent