BDBM442036 US10647708, Compound 25
SMILES OC(CCNC(=O)c1cccc(c1)-c1ccnnc1)CN1CCc2ccccc2C1
InChI Key InChIKey=RNEHZZGUNKCEJR-UHFFFAOYSA-N
Data  1 IC50
  Tab Delimited (TSV)   2D SDfile   Computed 3D by Vconf -m prep SDfile
Find this compound or compounds like it in BindingDB:
Activity Spreadsheet -- Enzyme Inhibition Constant Data from BindingDB
Found 1 hit for monomerid = 442036
TargetProtein arginine N-methyltransferase 5(Homo sapiens (Human))
Ctxt
US Patent
LigandPNGBDBM442036(US10647708, Compound 25)
Affinity DataIC50:  6.35E+3nM. Assay description: Full-length PRMT5 enzyme (NCBI Reference sequence NP_006100.2) was co-expressed with Hiss-MEP50 in insect cells and purified via Nickel immobilized m...
Ligand InfoPC cidPC sid
In DepthDetails US Patent