BDBM442045 US10647708, Compound 34
SMILES OC(CCNC(=O)c1noc(n1)-c1ccccc1)CN1CCc2ccccc2C1
InChI Key InChIKey=LVKAHBAPYZKTQM-UHFFFAOYSA-N
Data  1 IC50
  Tab Delimited (TSV)   2D SDfile   Computed 3D by Vconf -m prep SDfile
Find this compound or compounds like it in BindingDB:
Activity Spreadsheet -- Enzyme Inhibition Constant Data from BindingDB
Found 1 hit for monomerid = 442045
TargetProtein arginine N-methyltransferase 5(Homo sapiens (Human))
Ctxt
US Patent
LigandPNGBDBM442045(US10647708, Compound 34)
Affinity DataIC50:  5.61E+4nM. Assay description: Full-length PRMT5 enzyme (NCBI Reference sequence NP_006100.2) was co-expressed with Hiss-MEP50 in insect cells and purified via Nickel immobilized m...
Ligand InfoPC cidPC sid
In DepthDetails US Patent