BDBM442207 US10647713, Compound I-168::US11396508, Compound I-168
SMILES COC1CN(C1)c1cnc(Nc2cc(Nc3cccc(-c4nc(C)nn4C)c3OC)c3nc(C)[nH]c3n2)cc1F
InChI Key InChIKey=FNGGYYHWYBIWER-UHFFFAOYSA-N
Data  2 Kd
  Tab Delimited (TSV)   2D SDfile   Computed 3D by Vconf -m prep SDfile
Find this compound or compounds like it in BindingDB:
Activity Spreadsheet -- Enzyme Inhibition Constant Data from BindingDB
Found 2 hits for monomerid = 442207
TargetNon-receptor tyrosine-protein kinase TYK2 [556-888](Homo sapiens (Human))
Nimbus Lakshmi
US Patent
LigandPNGBDBM442207(US10647713, Compound I-168 | US11396508, Compound ...)
Affinity DataKd: >10nM. Assay description: The binding reaction was assembled by combining 16 μl of DNA-tagged kinase extract, 3.8 μl liganded affinity beads, and 0.18 μl test c...
Ligand InfoPC cidPC sid
In DepthDetails US Patent
TargetNon-receptor tyrosine-protein kinase TYK2 [556-888](Homo sapiens (Human))
Nimbus Lakshmi
US Patent
LigandPNGBDBM442207(US10647713, Compound I-168 | US11396508, Compound ...)
Affinity DataKd: >10nM. Assay description: Binding constants for compounds of the present invention against the JH2 domain were determined by the following protocol for a KINOMEscan® assay (Di...
Ligand InfoPC cidPC sid
In DepthDetails US Patent