BDBM442285 US10647713, Compound I-246::US11396508, Compound I-246
SMILES Cc1cn(C)nc1-c1ccc(Nc2cc(NC(=O)C3CC3)nc3[nH]c(nc23)C(F)F)c(c1)S(C)(=O)=O
InChI Key InChIKey=TUVSKGVQGHJWPM-UHFFFAOYSA-N
Data  2 Kd
  Tab Delimited (TSV)   2D SDfile   Computed 3D by Vconf -m prep SDfile
Find this compound or compounds like it in BindingDB:
Activity Spreadsheet -- Enzyme Inhibition Constant Data from BindingDB
Found 2 hits for monomerid = 442285
TargetNon-receptor tyrosine-protein kinase TYK2 [556-888](Homo sapiens (Human))
Nimbus Lakshmi
US Patent
LigandPNGBDBM442285(US10647713, Compound I-246 | US11396508, Compound ...)
Affinity DataKd: <1.00E+5nM. Assay description: The binding reaction was assembled by combining 16 μl of DNA-tagged kinase extract, 3.8 μl liganded affinity beads, and 0.18 μl test c...
Ligand InfoPC cidPC sid
In DepthDetails US Patent
TargetNon-receptor tyrosine-protein kinase TYK2 [556-888](Homo sapiens (Human))
Nimbus Lakshmi
US Patent
LigandPNGBDBM442285(US10647713, Compound I-246 | US11396508, Compound ...)
Affinity DataKd: <0.100nM. Assay description: Binding constants for compounds of the present invention against the JH2 domain were determined by the following protocol for a KINOMEscan® assay (Di...
Ligand InfoPC cidPC sid
In DepthDetails US Patent