BDBM44255 (2S)-1-[(2S)-3,3-dimethyl-2-[2-(methylamino)propanoylamino]butanoyl]-N-(diphenylmethyl)pyrrolidine-2-carboxamide;2,2,2-tris(fluoranyl)ethanoic acid::(2S)-1-[(2S)-3,3-dimethyl-2-[[2-(methylamino)-1-oxopropyl]amino]-1-oxobutyl]-N-(diphenylmethyl)-2-pyrrolidinecarboxamide;2,2,2-trifluoroacetic acid::(2S)-N-benzhydryl-1-[(2S)-3,3-dimethyl-2-[2-(methylamino)propanoylamino]butanoyl]pyrrolidine-2-carboxamide;2,2,2-trifluoroacetic acid::MLS-0390870.0001::cid_25181250
SMILES CNC(C)C(=O)N[C@H](C(=O)N1CCC[C@H]1C(=O)NC(c1ccccc1)c1ccccc1)C(C)(C)C
InChI Key InChIKey=IJVMSMRIOSLRIP-DGUFBMEBSA-N
Data  2 IC50
  Tab Delimited (TSV)   2D SDfile   Computed 3D by Vconf -m prep SDfile
Find this compound or compounds like it in BindingDB:
Activity Spreadsheet -- Enzyme Inhibition Constant Data from BindingDB
Found 2 hits for monomerid = 44255
TargetE3 ubiquitin-protein ligase XIAP(Homo sapiens (Human))
Burnham Center For Chemical Genomics
Curated by PubChem BioAssay
LigandPNGBDBM44255((2S)-1-[(2S)-3,3-dimethyl-2-[2-(methylamino)propan...)
Affinity DataIC50:  1.50E+3nM. Assay description: Data Source: Sanford-Burnham Center for Chemical Genomics (SBCCG) Source Affiliation: Sanford-Burnham Medical Research Institute (SBMRI, San Diego, C...
In DepthDetails PCBioAssay
TargetE3 ubiquitin-protein ligase XIAP(Homo sapiens (Human))
Burnham Center For Chemical Genomics
Curated by PubChem BioAssay
LigandPNGBDBM44255((2S)-1-[(2S)-3,3-dimethyl-2-[2-(methylamino)propan...)
Affinity DataIC50:  3.70E+3nM. Assay description: Data Source: Sanford-Burnham Center for Chemical Genomics (SBCCG) Source Affiliation: Sanford-Burnham Medical Research Institute (SBMRI, San Diego, C...
In DepthDetails PCBioAssay