BDBM442772 1-Methyl-4-{1-[4-(trifluoromethyl)phenyl]cyclopropylamino}-1H-pyrazolo[3,4-d]pyrimidine-6-carbonitrile::US10647727, Example 29
SMILES Cn1ncc2c(NC3(CC3)c3ccc(cc3)C(F)(F)F)nc(nc12)C#N
InChI Key InChIKey=YZFLKZURCKIMOP-UHFFFAOYSA-N
Data  2 KI
  Tab Delimited (TSV)   2D SDfile   Computed 3D by Vconf -m prep SDfile
Find this compound or compounds like it in BindingDB:
Activity Spreadsheet -- Enzyme Inhibition Constant Data from BindingDB
Found 2 hits for monomerid = 442772
TargetcGMP-dependent 3',5'-cyclic phosphodiesterase(Homo sapiens (Human))
Merck Sharp & Dohme
US Patent
LigandPNGBDBM442772(1-Methyl-4-{1-[4-(trifluoromethyl)phenyl]cycloprop...)
Affinity DataKi:  39nM. Assay description: In a typical experiment the PDE2 inhibitory activity of the compounds of the present invention was determined in accordance with the following experi...
Ligand InfoPC cidPC sid
In DepthDetails US Patent
TargetPhosphodiesterase(Macaca mulatta (Rhesus macaque))
Merck Sharp & Dohme
US Patent
LigandPNGBDBM442772(1-Methyl-4-{1-[4-(trifluoromethyl)phenyl]cycloprop...)
Affinity DataKi:  47nM. Assay description: In a typical experiment the PDE2 inhibitory activity of the compounds of the present invention was determined in accordance with the following experi...
Ligand InfoPC cidPC sid
In DepthDetails US Patent