BDBM44281 (2S)-1-[(2S)-2-[[(2S)-2-amino-1-oxopropyl]amino]-3-methyl-1-oxobutyl]-N-(diphenylmethyl)-2-pyrrolidinecarboxamide;2,2,2-trifluoroacetic acid::(2S)-1-[(2S)-2-[[(2S)-2-aminopropanoyl]amino]-3-methyl-butanoyl]-N-benzhydryl-pyrrolidine-2-carboxamide;2,2,2-trifluoroacetic acid::(2S)-1-[(2S)-2-[[(2S)-2-aminopropanoyl]amino]-3-methylbutanoyl]-N-benzhydrylpyrrolidine-2-carboxamide;2,2,2-trifluoroacetic acid::(2S)-1-[(2S)-2-[[(2S)-2-azanylpropanoyl]amino]-3-methyl-butanoyl]-N-(diphenylmethyl)pyrrolidine-2-carboxamide;2,2,2-tris(fluoranyl)ethanoic acid::MLS-0390979.0001::cid_25241687
SMILES CC(C)[C@H](NC(=O)[C@H](C)N)C(=O)N1CCC[C@H]1C(=O)NC(c1ccccc1)c1ccccc1
InChI Key InChIKey=WKJJKOCFFPMSNU-NYVOZVTQSA-N
Data  2 IC50
  Tab Delimited (TSV)   2D SDfile   Computed 3D by Vconf -m prep SDfile
Find this compound or compounds like it in BindingDB:
Activity Spreadsheet -- Enzyme Inhibition Constant Data from BindingDB
Found 2 hits for monomerid = 44281
TargetE3 ubiquitin-protein ligase XIAP(Homo sapiens (Human))
Burnham Center For Chemical Genomics
Curated by PubChem BioAssay
LigandPNGBDBM44281((2S)-1-[(2S)-2-[[(2S)-2-amino-1-oxopropyl]amino]-3...)
Affinity DataIC50:  790nM. Assay description: Data Source: Sanford-Burnham Center for Chemical Genomics (SBCCG) Source Affiliation: Sanford-Burnham Medical Research Institute (SBMRI, San Diego, C...
In DepthDetails PCBioAssay
TargetE3 ubiquitin-protein ligase XIAP(Homo sapiens (Human))
Burnham Center For Chemical Genomics
Curated by PubChem BioAssay
LigandPNGBDBM44281((2S)-1-[(2S)-2-[[(2S)-2-amino-1-oxopropyl]amino]-3...)
Affinity DataIC50:  3.10E+3nM. Assay description: Data Source: Sanford-Burnham Center for Chemical Genomics (SBCCG) Source Affiliation: Sanford-Burnham Medical Research Institute (SBMRI, San Diego, C...
In DepthDetails PCBioAssay