BDBM443044 2-(([1,1'-biphenyl]-4- ylmethyl)amino)-N-hydroxy-1H- benzo[d]imidazole-6-carboxamide::US10654814, Example 125
SMILES ONC(=O)c1ccc2nc(NCc3ccc(cc3)-c3ccccc3)[nH]c2c1
InChI Key InChIKey=ZYBQPIUVDLPCKB-UHFFFAOYSA-N
Data  1 IC50
  Tab Delimited (TSV)   2D SDfile   Computed 3D by Vconf -m prep SDfile
Find this compound or compounds like it in BindingDB:
Activity Spreadsheet -- Enzyme Inhibition Constant Data from BindingDB
Found 1 hit for monomerid = 443044
TargetHistone deacetylase 6(Homo sapiens (Human))
Kancera
US Patent
LigandPNGBDBM443044(2-(([1,1'-biphenyl]-4- ylmethyl)amino)-N-hydroxy-1...)
Affinity DataIC50:  7nM. Assay description: The assay principle is well known and all necessary reagents like enzymes, substrates, developer and reference compounds are commercially available. ...
Ligand InfoPC cidPC sid
In DepthDetails US Patent