BDBM443054 2-((3-(benzyloxy)phenyl)amino)-N- hydroxy-1-methyl-1H- benzo[d]imidazole-5-carboxamide::US10654814, Example 142
SMILES Cn1c(Nc2cccc(OCc3ccccc3)c2)nc2cc(ccc12)C(=O)NO
InChI Key InChIKey=VUJJSCFDSHVNSU-UHFFFAOYSA-N
Data  1 IC50
  Tab Delimited (TSV)   2D SDfile   Computed 3D by Vconf -m prep SDfile
Find this compound or compounds like it in BindingDB:
Activity Spreadsheet -- Enzyme Inhibition Constant Data from BindingDB
Found 1 hit for monomerid = 443054
TargetHistone deacetylase 6(Homo sapiens (Human))
Kancera
US Patent
LigandPNGBDBM443054(2-((3-(benzyloxy)phenyl)amino)-N- hydroxy-1-methyl...)
Affinity DataIC50:  1nM. Assay description: The assay principle is well known and all necessary reagents like enzymes, substrates, developer and reference compounds are commercially available. ...
Ligand InfoPC cidPC sid
In DepthDetails US Patent