BDBM44307 (2S)-N-[(1S)-2-(1-anthrylamino)-2-keto-1-methyl-ethyl]-3-methyl-2-[[(2S)-2-(methylamino)propanoyl]amino]butyramide;formic acid::(2S)-N-[(2S)-1-(1-anthracenylamino)-1-oxopropan-2-yl]-3-methyl-2-[[(2S)-2-(methylamino)-1-oxopropyl]amino]butanamide;formic acid::(2S)-N-[(2S)-1-(anthracen-1-ylamino)-1-oxidanylidene-propan-2-yl]-3-methyl-2-[[(2S)-2-(methylamino)propanoyl]amino]butanamide;methanoic acid::(2S)-N-[(2S)-1-(anthracen-1-ylamino)-1-oxopropan-2-yl]-3-methyl-2-[[(2S)-2-(methylamino)propanoyl]amino]butanamide;formic acid::MLS-0412070.0001::cid_44182187
SMILES CN[C@@H](C)C(=O)N[C@@H](C(C)C)C(=O)N[C@@H](C)C(=O)Nc1cccc2cc3ccccc3cc12
InChI Key InChIKey=GKXFEKMSFDSYFC-QQMNAOGKSA-N
Data  1 IC50
  Tab Delimited (TSV)   2D SDfile   Computed 3D by Vconf -m prep SDfile
Find this compound or compounds like it in BindingDB:
Activity Spreadsheet -- Enzyme Inhibition Constant Data from BindingDB
Found 1 hit for monomerid = 44307
TargetE3 ubiquitin-protein ligase XIAP(Homo sapiens (Human))
Burnham Center For Chemical Genomics
Curated by PubChem BioAssay
LigandPNGBDBM44307((2S)-N-[(1S)-2-(1-anthrylamino)-2-keto-1-methyl-et...)
Affinity DataIC50:  1.66E+4nM. Assay description: Data Source: Sanford-Burnham Center for Chemical Genomics (SBCCG) Source Affiliation: Sanford-Burnham Medical Research Institute (SBMRI, San Diego, C...
In DepthDetails PCBioAssay