BDBM443090 N-hydroxy-2-(piperidin-1- ylmethyl)-1,3-benzothiazole-5- carboxamide::US10654814, Example 273
SMILES ONC(=O)c1ccc2sc(CN3CCCCC3)nc2c1
InChI Key InChIKey=AELIOMOOVZVZDJ-UHFFFAOYSA-N
Data  1 IC50
  Tab Delimited (TSV)   2D SDfile   Computed 3D by Vconf -m prep SDfile
Find this compound or compounds like it in BindingDB:
Activity Spreadsheet -- Enzyme Inhibition Constant Data from BindingDB
Found 1 hit for monomerid = 443090
TargetHistone deacetylase 6(Homo sapiens (Human))
Kancera
US Patent
LigandPNGBDBM443090(N-hydroxy-2-(piperidin-1- ylmethyl)-1,3-benzothiaz...)
Affinity DataIC50:  16nM. Assay description: The assay principle is well known and all necessary reagents like enzymes, substrates, developer and reference compounds are commercially available. ...
Ligand InfoPC cidPC sid
In DepthDetails US Patent