BDBM44311 (2S)-2-[[(2S)-2-amino-1-oxopropyl]amino]-3-methyl-N-[(2S)-1-oxo-1-(phenylhydrazo)propan-2-yl]butanamide;formic acid::(2S)-2-[[(2S)-2-aminopropanoyl]amino]-3-methyl-N-[(2S)-1-oxo-1-(2-phenylhydrazinyl)propan-2-yl]butanamide;formic acid::(2S)-2-[[(2S)-2-aminopropanoyl]amino]-N-[(1S)-2-keto-1-methyl-2-(N'-phenylhydrazino)ethyl]-3-methyl-butyramide;formic acid::(2S)-2-[[(2S)-2-azanylpropanoyl]amino]-3-methyl-N-[(2S)-1-oxidanylidene-1-(2-phenylhydrazinyl)propan-2-yl]butanamide;methanoic acid::CHEMBL1617819::MLS-0412113.0001::cid_44182205
SMILES CC(C)[C@H](NC(=O)[C@H](C)N)C(=O)N[C@@H](C)C(=O)NNc1ccccc1
InChI Key InChIKey=HIXATJZIAGPDBU-OBJOEFQTSA-N
Data  2 KI  2 IC50
  Tab Delimited (TSV)   2D SDfile   Computed 3D by Vconf -m prep SDfile
Find this compound or compounds like it in BindingDB:
Activity Spreadsheet -- Enzyme Inhibition Constant Data from BindingDB
Found 4 hits for monomerid = 44311
TargetE3 ubiquitin-protein ligase XIAP(Homo sapiens (Human))
Sanford-Burnham Medical Research Institute
Curated by ChEMBL
LigandPNGBDBM44311((2S)-2-[[(2S)-2-amino-1-oxopropyl]amino]-3-methyl-...)
Affinity DataKi:  1.83E+3nM. Assay description: Competitive inhibition of XIAP-BIR2 domain (unknown origin) by fluorescence polarization assay
In DepthDetails ArticlePubMed
TargetE3 ubiquitin-protein ligase XIAP(Homo sapiens (Human))
Sanford-Burnham Medical Research Institute
Curated by ChEMBL
LigandPNGBDBM44311((2S)-2-[[(2S)-2-amino-1-oxopropyl]amino]-3-methyl-...)
Affinity DataKi:  4.13E+4nM. Assay description: Competitive inhibition of XIAP-BIR3 domain (unknown origin) by fluorescence polarization assay
In DepthDetails ArticlePubMed
TargetE3 ubiquitin-protein ligase XIAP(Homo sapiens (Human))
Sanford-Burnham Medical Research Institute
Curated by ChEMBL
LigandPNGBDBM44311((2S)-2-[[(2S)-2-amino-1-oxopropyl]amino]-3-methyl-...)
Affinity DataIC50:  3.30E+3nM. Assay description: Data Source: Sanford-Burnham Center for Chemical Genomics (SBCCG) Source Affiliation: Sanford-Burnham Medical Research Institute (SBMRI, San Diego, C...
In DepthDetails PCBioAssay
TargetE3 ubiquitin-protein ligase XIAP(Homo sapiens (Human))
Sanford-Burnham Medical Research Institute
Curated by ChEMBL
LigandPNGBDBM44311((2S)-2-[[(2S)-2-amino-1-oxopropyl]amino]-3-methyl-...)
Affinity DataIC50:  1.06E+5nM. Assay description: Data Source: Sanford-Burnham Center for Chemical Genomics (SBCCG) Source Affiliation: Sanford-Burnham Medical Research Institute (SBMRI, San Diego, C...
In DepthDetails PCBioAssay