BDBM443141 US10654833, Compound 41
SMILES CC(C)n1cnnc1-c1cccc(n1)N1Cc2ccc(cc2C1=O)-c1ccc(cc1)C(C)(C)C(O)=O
InChI Key InChIKey=INQOLLNVZDZNKR-UHFFFAOYSA-N
Data  1 IC50
  Tab Delimited (TSV)   2D SDfile   Computed 3D by Vconf -m prep SDfile
Find this compound or compounds like it in BindingDB:
Activity Spreadsheet -- Enzyme Inhibition Constant Data from BindingDB
Found 1 hit for monomerid = 443141
TargetMitogen-activated protein kinase kinase kinase 5(Homo sapiens (Human))
Hepatikos Therapeutics
US Patent
LigandPNGBDBM443141(US10654833, Compound 41)
Affinity DataIC50:  4.70nM. Assay description: Inhibition of ASK1 kinase activity was determined radiometrically using 33P substrate incorporation (Reaction Biology Corp., Malvern, Pa.). Briefly, ...
Ligand InfoPC cidPC sid
In DepthDetails US Patent