BDBM443162 US10654833, Compound 74
SMILES CC(C)n1cnnc1-c1cccc(n1)N1Cc2ccc(cc2C1=O)-c1ccc(cc1C)C(O)=O
InChI Key InChIKey=BSGWMYZHBUSLCJ-UHFFFAOYSA-N
Data  1 IC50
  Tab Delimited (TSV)   2D SDfile   Computed 3D by Vconf -m prep SDfile
Find this compound or compounds like it in BindingDB:
Activity Spreadsheet -- Enzyme Inhibition Constant Data from BindingDB
Found 1 hit for monomerid = 443162
TargetMitogen-activated protein kinase kinase kinase 5(Homo sapiens (Human))
Hepatikos Therapeutics
US Patent
LigandPNGBDBM443162(US10654833, Compound 74)
Affinity DataIC50:  5.70nM. Assay description: Inhibition of ASK1 kinase activity was determined radiometrically using 33P substrate incorporation (Reaction Biology Corp., Malvern, Pa.). Briefly, ...
Ligand InfoPC cidPC sid
In DepthDetails US Patent