BDBM443242 5-(1-Cyano-2'-oxo-1',4'- dihydro-2'H- spiro[pyrrolidine-3,3'- quinolin]-7'-yl)-N- methylpicolinamide::US10654853, Example 15
SMILES CNC(=O)c1ccc(cn1)-c1ccc2CC3(CCN(C3)C#N)C(=O)Nc2c1
InChI Key InChIKey=ORCWWINZVHVWDU-UHFFFAOYSA-N
Data  1 IC50
  Tab Delimited (TSV)   2D SDfile   Computed 3D by Vconf -m prep SDfile
Find this compound or compounds like it in BindingDB:
Activity Spreadsheet -- Enzyme Inhibition Constant Data from BindingDB
Found 1 hit for monomerid = 443242
TargetOTU domain-containing protein 7B(Human)
Mission Therapeutics
US Patent
LigandPNGBDBM443242(5-(1-Cyano-2'-oxo-1',4'- dihydro-2'H- spiro[pyrrol...)
Affinity DataIC50:  5.50E+3nM. Assay description: Dilution plates were prepared at 21 times the final concentration (2100 μM for a final concentration of 100 μM) in 50% DMSO in a 96-well po...
Ligand InfoPC cidPC sid
In DepthDetails US Patent