BDBM443296 (S)-7-(3- Fluorophenyl)- 2-oxo-1,2- dihydrospiro [pyrido[2,3- b][1,4]oxazine- 3,3'- pyrrolidine]-1'- carbonitrile::US10654853, Example 69::US11236092, Example 69
SMILES Fc1cccc(c1)-c1cnc2O[C@]3(CCN(C3)C#N)C(=O)Nc2c1
InChI Key InChIKey=WWIKEUVTLWVECX-KRWDZBQOSA-N
Data  2 IC50
  Tab Delimited (TSV)   2D SDfile   Computed 3D by Vconf -m prep SDfile
Find this compound or compounds like it in BindingDB:
Activity Spreadsheet -- Enzyme Inhibition Constant Data from BindingDB
Found 2 hits for monomerid = 443296
TargetOTU domain-containing protein 7B(Human)
Mission Therapeutics
US Patent
LigandPNGBDBM443296((S)-7-(3- Fluorophenyl)- 2-oxo-1,2- dihydrospiro [...)
Affinity DataIC50:  550nM. Assay description: Dilution plates were prepared at 21 times the final concentration (2100 μM for a final concentration of 100 μM) in 50% DMSO in a 96-well po...
Ligand InfoPC cidPC sid
In DepthDetails US Patent
TargetOTU domain-containing protein 7B(Human)
Mission Therapeutics
US Patent
LigandPNGBDBM443296((S)-7-(3- Fluorophenyl)- 2-oxo-1,2- dihydrospiro [...)
Affinity DataIC50:  550nM. Assay description: Dilution plates were prepared at 21 times the final concentration (2100 μM for a final concentration of 100 μM) in 50% DMSO in a 96-well po...
Ligand InfoPC cidPC sid
In DepthDetails US Patent