BDBM443305 (8S)-8-Methyl-7,10-dioxo-2,6,9-triazaspiro[4.5]decane-2-carbonitrile::US10654853, Example 78::US11236092, Example 78
SMILES C[C@@H]1NC(=O)C2(CCN(C2)C#N)NC1=O
InChI Key InChIKey=XNJLFQMZCFESGX-AADKRJSRSA-N
Data  2 IC50
  Tab Delimited (TSV)   2D SDfile   Computed 3D by Vconf -m prep SDfile
Find this compound or compounds like it in BindingDB:
Activity Spreadsheet -- Enzyme Inhibition Constant Data from BindingDB
Found 2 hits for monomerid = 443305
TargetOTU domain-containing protein 7B(Human)
Mission Therapeutics
US Patent
LigandPNGBDBM443305((8S)-8-Methyl-7,10-dioxo-2,6,9-triazaspiro[4.5]dec...)
Affinity DataIC50:  5.50E+3nM. Assay description: Dilution plates were prepared at 21 times the final concentration (2100 μM for a final concentration of 100 μM) in 50% DMSO in a 96-well po...
Ligand InfoPC cidPC sid
In DepthDetails US Patent
TargetOTU domain-containing protein 7B(Human)
Mission Therapeutics
US Patent
LigandPNGBDBM443305((8S)-8-Methyl-7,10-dioxo-2,6,9-triazaspiro[4.5]dec...)
Affinity DataIC50:  5.50E+3nM. Assay description: Dilution plates were prepared at 21 times the final concentration (2100 μM for a final concentration of 100 μM) in 50% DMSO in a 96-well po...
Ligand InfoPC cidPC sid
In DepthDetails US Patent