BDBM443325 5-(1-Cyano-2'-oxo-1',4'-dihydro-2'H- spiro[pyrrolidine-3,3'-quinolin]-6'-yl)- N-methylpicolinamide::US10654853, Example 98::US11236092, Example 98
SMILES CNC(=O)c1ccc(cn1)-c1ccc2NC(=O)C3(CCN(C3)C#N)Cc2c1
InChI Key InChIKey=XLGFQPFROQWIMH-UHFFFAOYSA-N
Data  3 IC50
  Tab Delimited (TSV)   2D SDfile   Computed 3D by Vconf -m prep SDfile
Find this compound or compounds like it in BindingDB:
Activity Spreadsheet -- Enzyme Inhibition Constant Data from BindingDB
Found 3 hits for monomerid = 443325
TargetOTU domain-containing protein 7B(Human)
Mission Therapeutics
US Patent
LigandPNGBDBM443325(5-(1-Cyano-2'-oxo-1',4'-dihydro-2'H- spiro[pyrroli...)
Affinity DataIC50:  550nM. Assay description: Dilution plates were prepared at 21 times the final concentration (2100 μM for a final concentration of 100 μM) in 50% DMSO in a 96-well po...
Ligand InfoPC cidPC sid
In DepthDetails US Patent
TargetOTU domain-containing protein 7B(Human)
Mission Therapeutics
US Patent
LigandPNGBDBM443325(5-(1-Cyano-2'-oxo-1',4'-dihydro-2'H- spiro[pyrroli...)
Affinity DataIC50:  550nM. Assay description: Dilution plates were prepared at 21 times the final concentration (2100 μM for a final concentration of 100 μM) in 50% DMSO in a 96-well po...
Ligand InfoPC cidPC sid
In DepthDetails US Patent
TargetOTU domain-containing protein 7B(Human)
Mission Therapeutics
US Patent
LigandPNGBDBM443325(5-(1-Cyano-2'-oxo-1',4'-dihydro-2'H- spiro[pyrroli...)
Affinity DataIC50:  5.50E+3nM. Assay description: Dilution plates were prepared at 21 times the final concentration (2100 μM for a final concentration of 100 μM) in 50% DMSO in a 96-well po...
Ligand InfoPC cidPC sid
In DepthDetails US Patent