BDBM443326 6'-(2-(Benzyloxy)phenyl)-2'-oxo-1',4'- dihydro-2'H-spiro[pyrrolidine-3,3'- quinoline]-1-carbonitrile::US10654853, Example 99
SMILES O=C1Nc2ccc(cc2CC11CCN(C1)C#N)-c1ccccc1Oc1ccccc1
InChI Key InChIKey=VXSGEOWEDUVYRZ-UHFFFAOYSA-N
Data  1 IC50
  Tab Delimited (TSV)   2D SDfile   Computed 3D by Vconf -m prep SDfile
Find this compound or compounds like it in BindingDB:
Activity Spreadsheet -- Enzyme Inhibition Constant Data from BindingDB
Found 1 hit for monomerid = 443326
TargetOTU domain-containing protein 7B(Human)
Mission Therapeutics
US Patent
LigandPNGBDBM443326(6'-(2-(Benzyloxy)phenyl)-2'-oxo-1',4'- dihydro-2'H...)
Affinity DataIC50:  5.50E+3nM. Assay description: Dilution plates were prepared at 21 times the final concentration (2100 μM for a final concentration of 100 μM) in 50% DMSO in a 96-well po...
Ligand InfoPC cidPC sid
In DepthDetails US Patent