BDBM443489 (2S,4R)-1-(2- (3-acetyl-5- (pyrimidin-5- ylamino)-1H- indol-1- yl)acetyl)-4- fluoro-N-(4- phenylbutyl) pyrrolidine-2- carboxamide::US10660876, Cmpd No. 156
SMILES CC(=O)c1cn(CC(=O)N2C[C@H](F)C[C@H]2C(=O)NCCCCc2ccccc2)c2ccc(Nc3cncnc3)cc12
InChI Key InChIKey=FDBRPALVNZMEJG-BTYSJIOQSA-N
Data  1 IC50
  Tab Delimited (TSV)   2D SDfile   Computed 3D by Vconf -m prep SDfile
Find this compound or compounds like it in BindingDB:
Activity Spreadsheet -- Enzyme Inhibition Constant Data from BindingDB
Found 1 hit for monomerid = 443489
TargetComplement factor D(Homo sapiens (Human))
Achillion Pharmaceuticals
US Patent
LigandPNGBDBM443489((2S,4R)-1-(2- (3-acetyl-5- (pyrimidin-5- ylamino)-...)
Affinity DataIC50: <1.00E+3nM. Assay description: Human Factor D (purified from human serum, Complement Technology, Inc.) at 80 nM final concentration is incubated with test compound at various conce...
Ligand InfoPC cidPC sid
In DepthDetails US Patent