BDBM44388 5-(2-furanyl)-2-(4-methoxyphenyl)-5,6-dihydro-[1,2,4]triazolo[5,1-b][1,3]thiazin-7-one::5-(2-furyl)-2-(4-methoxyphenyl)-5,6-dihydro-[1,2,4]triazolo[5,1-b][1,3]thiazin-7-one::5-(furan-2-yl)-2-(4-methoxyphenyl)-5,6-dihydro-[1,2,4]triazolo[5,1-b][1,3]thiazin-7-one::MLS000037315::SMR000036090::cid_661020
SMILES COc1ccc(cc1)-c1nc2SC(CC(=O)n2n1)c1ccco1
InChI Key InChIKey=AXBMNUDRRFIDSU-UHFFFAOYSA-N
Data  1 IC50
  Tab Delimited (TSV)   2D SDfile   Computed 3D by Vconf -m prep SDfile
Find this compound or compounds like it in BindingDB:
Activity Spreadsheet -- Enzyme Inhibition Constant Data from BindingDB
Found 1 hit for monomerid = 44388
TargetAlkaline phosphatase, tissue-nonspecific isozyme(Homo sapiens (Human))
Burnham Center For Chemical Genomics
Curated by PubChem BioAssay
LigandPNGBDBM44388(5-(2-furanyl)-2-(4-methoxyphenyl)-5,6-dihydro-[1,2...)
Affinity DataIC50:  3.82E+3nM. Assay description: Sanford-Burnham Center for Chemical Genomics (SBCCG) Sanford-Burnham Medical Research Institute (SBMRI, San Diego, CA) NIH Molecular Libraries Screen...
In DepthDetails PCBioAssay