BDBM444303 US10660898, Example 18
SMILES CCc1nc2c(F)cc(cc2n1Cc1cccc(Cl)c1Cl)N1CCOCC1
InChI Key InChIKey=SLPHAOVJOGOMFI-UHFFFAOYSA-N
Data  1 IC50
  Tab Delimited (TSV)   2D SDfile   Computed 3D by Vconf -m prep SDfile
Find this compound or compounds like it in BindingDB:
Activity Spreadsheet -- Enzyme Inhibition Constant Data from BindingDB
Found 1 hit for monomerid = 444303
TargetPhosphatidylinositol 4-phosphate 3-kinase C2 domain-containing subunit beta(Homo sapiens (Human))
Glaxosmithkline
US Patent
LigandPNGBDBM444303(US10660898, Example 18)
Affinity DataIC50:  10nM. Assay description: PI3Kinase Reaction Buffer was prepared by diluting the stock 1:4 with de-ionized water. Freshly prepared DTT was added at a final concentration of 5 ...
Ligand InfoPC cidPC sid
In DepthDetails US Patent