BDBM444356 N-(amino(((6-(4-chloro-2-fluorophenyl)-5-(4-chlorophenyl)pyridin-3-yl)methyl)amino)methylene)benzenesulfonamide::US10662156, Compound of Example 36
SMILES N\C(NCc1cnc(-c2ccc(Cl)cc2F)c(c1)-c1ccc(Cl)cc1)=N/S(=O)(=O)c1ccccc1
InChI Key InChIKey=PNCQRMZRBKGBDF-UHFFFAOYSA-N
Data  1 IC50
  Tab Delimited (TSV)   2D SDfile   Computed 3D by Vconf -m prep SDfile
Find this compound or compounds like it in BindingDB:
Activity Spreadsheet -- Enzyme Inhibition Constant Data from BindingDB
Found 1 hit for monomerid = 444356
TargetMucosa-associated lymphoid tissue lymphoma translocation protein 1(Homo sapiens (Human))
Toray Industries
US Patent
LigandPNGBDBM444356(N-(amino(((6-(4-chloro-2-fluorophenyl)-5-(4-chloro...)
Affinity DataIC50:  237nM. Assay description: Full-length cDNA of human MALT1 gene (GenBank accession No: AB026118.1) amplified by PCR was inserted in flame to a SalI site located downstream of G...
Ligand InfoPC cidPC sid
In DepthDetails US Patent