BDBM444549 US10662186, Compound 69::US10988476, Compound I-69
SMILES CN(C)CCN1CCc2nc(Nc3ncc(F)c(n3)-c3cc(F)c4nc(C)n(c4c3)C(C)(C)C)ccc2C1
InChI Key InChIKey=AKGTYSYXMRZPBV-UHFFFAOYSA-N
Data  17 IC50
  Tab Delimited (TSV)   2D SDfile   Computed 3D by Vconf -m prep SDfile
Find this compound or compounds like it in BindingDB:
Activity Spreadsheet -- Enzyme Inhibition Constant Data from BindingDB
Found 17 hits for monomerid = 444549
TargetCyclin-dependent kinase 6/G1/S-specific cyclin-D3(Homo sapiens (Human))
Shanghai Pharmaceuticals Holding
Curated by ChEMBL
LigandPNGBDBM444549(US10662186, Compound 69 | US10988476, Compound I-6...)
Affinity DataIC50:  2nM. Assay description: Inhibition of recombinant human full length N-terminal GST-tagged CDK6 (1 to 326 residues)/cyclin D3 (1 to 292 residues) expressed in baculovirus exp...
Ligand InfoPC cidPC sid
In DepthDetails ArticlePubMed
TargetCyclin-dependent kinase 9(Homo sapiens (Human))
Shanghai Pharmaceuticals Holding
US Patent
LigandPNGBDBM444549(US10662186, Compound 69 | US10988476, Compound I-6...)
Affinity DataIC50:  16.2nM. Assay description: 1. Take 10 mM stock solution of the test compound, in 96-well compound plate, DMSO was used to dilute the compound to an initial concentration of 100...
Ligand InfoPC cidPC sid
In DepthDetails US Patent
TargetCyclin-dependent kinase 4/G1/S-specific cyclin-D3(Homo sapiens (Human))
Shanghai Pharmaceuticals Holding
Curated by ChEMBL
LigandPNGBDBM444549(US10662186, Compound 69 | US10988476, Compound I-6...)
Affinity DataIC50:  1.60nM. Assay description: Inhibition of recombinant human full length N-terminal GST-tagged CDK4 (1 to 303 residues)/cyclin D3 (1 to 292 residues) expressed in baculovirus exp...
Ligand InfoPC cidPC sid
In DepthDetails ArticlePubMed
TargetCyclin-dependent kinase 4(Homo sapiens (Human))
Shanghai Pharmaceuticals Holding
US Patent
LigandPNGBDBM444549(US10662186, Compound 69 | US10988476, Compound I-6...)
Affinity DataIC50:  1.13nM. Assay description: 1. Take 10 mM stock solution of the test compound, in 96-well compound plate, DMSO was used to dilute the compound to an initial concentration of 100...
Ligand InfoPC cidPC sid
In DepthDetails US Patent
TargetCyclin-dependent kinase 6(Homo sapiens (Human))
Shanghai Pharmaceuticals Holding
US Patent
LigandPNGBDBM444549(US10662186, Compound 69 | US10988476, Compound I-6...)
Affinity DataIC50:  1.57nM. Assay description: 1. Take 10 mM stock solution of the test compound, in 96-well compound plate, DMSO was used to dilute the compound to an initial concentration of 100...
Ligand InfoPC cidPC sid
In DepthDetails US Patent
TargetCyclin-dependent kinase 2(Homo sapiens (Human))
Shanghai Pharmaceuticals Holding
US Patent
LigandPNGBDBM444549(US10662186, Compound 69 | US10988476, Compound I-6...)
Affinity DataIC50:  54.9nM. Assay description: 1. Take 10 mM stock solution of the test compound, in 96-well compound plate, DMSO was used to dilute the compound to an initial concentration of 100...
Ligand InfoPC cidPC sid
In DepthDetails US Patent
TargetCyclin-dependent kinase 1(Homo sapiens (Human))
Shanghai Pharmaceuticals Holding
US Patent
LigandPNGBDBM444549(US10662186, Compound 69 | US10988476, Compound I-6...)
Affinity DataIC50:  139nM. Assay description: 1. Take 10 mM stock solution of the test compound, in 96-well compound plate, DMSO was used to dilute the compound to an initial concentration of 100...
Ligand InfoPC cidPC sid
In DepthDetails US Patent
TargetCyclin-dependent kinase 5(Homo sapiens (Human))
Shanghai Pharmaceuticals Holding
US Patent
LigandPNGBDBM444549(US10662186, Compound 69 | US10988476, Compound I-6...)
Affinity DataIC50:  11.4nM. Assay description: 1. Take 10 mM stock solution of the test compound, in 96-well compound plate, DMSO was used to dilute the compound to an initial concentration of 100...
Ligand InfoPC cidPC sid
In DepthDetails US Patent
TargetCyclin-dependent kinase 7(Homo sapiens (Human))
Shanghai Pharmaceuticals Holding
US Patent
LigandPNGBDBM444549(US10662186, Compound 69 | US10988476, Compound I-6...)
Affinity DataIC50:  129nM. Assay description: 1. Take 10 mM stock solution of the test compound, in 96-well compound plate, DMSO was used to dilute the compound to an initial concentration of 100...
Ligand InfoPC cidPC sid
In DepthDetails US Patent
TargetCyclin-dependent kinase 9(Homo sapiens (Human))
Shanghai Pharmaceuticals Holding
US Patent
LigandPNGBDBM444549(US10662186, Compound 69 | US10988476, Compound I-6...)
Affinity DataIC50:  16.2nM. Assay description: 1. Take 10 mM stock solution of the test compound, in 96-well compound plate, DMSO was used to dilute the compound to an initial concentration of 100...
Ligand InfoPC cidPC sid
In DepthDetails US Patent
TargetCyclin-dependent kinase 4(Homo sapiens (Human))
Shanghai Pharmaceuticals Holding
US Patent
LigandPNGBDBM444549(US10662186, Compound 69 | US10988476, Compound I-6...)
Affinity DataIC50:  1.13nM. Assay description: 1. Take 10 mM stock solution of the test compound, in 96-well compound plate, DMSO was used to dilute the compound to an initial concentration of 100...
Ligand InfoPC cidPC sid
In DepthDetails US Patent
TargetCyclin-dependent kinase 6(Homo sapiens (Human))
Shanghai Pharmaceuticals Holding
US Patent
LigandPNGBDBM444549(US10662186, Compound 69 | US10988476, Compound I-6...)
Affinity DataIC50:  1.57nM. Assay description: 1. Take 10 mM stock solution of the test compound, in 96-well compound plate, DMSO was used to dilute the compound to an initial concentration of 100...
Ligand InfoPC cidPC sid
In DepthDetails US Patent
TargetCyclin-dependent kinase 2(Homo sapiens (Human))
Shanghai Pharmaceuticals Holding
US Patent
LigandPNGBDBM444549(US10662186, Compound 69 | US10988476, Compound I-6...)
Affinity DataIC50:  54.9nM. Assay description: 1. Take 10 mM stock solution of the test compound, in 96-well compound plate, DMSO was used to dilute the compound to an initial concentration of 100...
Ligand InfoPC cidPC sid
In DepthDetails US Patent
TargetCyclin-dependent kinase 1(Homo sapiens (Human))
Shanghai Pharmaceuticals Holding
US Patent
LigandPNGBDBM444549(US10662186, Compound 69 | US10988476, Compound I-6...)
Affinity DataIC50:  139nM. Assay description: 1. Take 10 mM stock solution of the test compound, in 96-well compound plate, DMSO was used to dilute the compound to an initial concentration of 100...
Ligand InfoPC cidPC sid
In DepthDetails US Patent
TargetCyclin-dependent kinase 5(Homo sapiens (Human))
Shanghai Pharmaceuticals Holding
US Patent
LigandPNGBDBM444549(US10662186, Compound 69 | US10988476, Compound I-6...)
Affinity DataIC50:  11.4nM. Assay description: 1. Take 10 mM stock solution of the test compound, in 96-well compound plate, DMSO was used to dilute the compound to an initial concentration of 100...
Ligand InfoPC cidPC sid
In DepthDetails US Patent
TargetCyclin-dependent kinase 7(Homo sapiens (Human))
Shanghai Pharmaceuticals Holding
US Patent
LigandPNGBDBM444549(US10662186, Compound 69 | US10988476, Compound I-6...)
Affinity DataIC50:  129nM. Assay description: 1. Take 10 mM stock solution of the test compound, in 96-well compound plate, DMSO was used to dilute the compound to an initial concentration of 100...
Ligand InfoPC cidPC sid
In DepthDetails US Patent
TargetCyclin-A2/Cyclin-dependent kinase 2(Homo sapiens (Human))
Shanghai Pharmaceuticals Holding
Curated by ChEMBL
LigandPNGBDBM444549(US10662186, Compound 69 | US10988476, Compound I-6...)
Affinity DataIC50:  22nM. Assay description: Inhibition of recombinant human full length N-terminal GST-tagged CDK2 (1 to 298 residues)/cyclin A2 (1 to 432 residues) expressed in baculovirus exp...
Ligand InfoPC cidPC sid
In DepthDetails ArticlePubMed