BDBM444575 US10662186, Compound 94::US10988476, Compound I-94
SMILES CN1CCO[C@H](CN2CCc3nc(Nc4ncc(F)c(n4)-c4cc(F)c5nc(C)n(c5c4)C(C)(C)C)ccc3C2)C1
InChI Key InChIKey=PBDNNWWYSHCMCH-NRFANRHFSA-N
Data  14 IC50
  Tab Delimited (TSV)   2D SDfile   Computed 3D by Vconf -m prep SDfile
Find this compound or compounds like it in BindingDB:
Activity Spreadsheet -- Enzyme Inhibition Constant Data from BindingDB
Found 14 hits for monomerid = 444575
TargetCyclin-dependent kinase 4(Homo sapiens (Human))
Shanghai Pharmaceuticals Holding
US Patent
LigandPNGBDBM444575(US10662186, Compound 94 | US10988476, Compound I-9...)
Affinity DataIC50:  1.16nM. Assay description: 1. Take 10 mM stock solution of the test compound, in 96-well compound plate, DMSO was used to dilute the compound to an initial concentration of 100...
Ligand InfoPC cidPC sid
In DepthDetails US Patent
TargetCyclin-dependent kinase 6(Homo sapiens (Human))
Shanghai Pharmaceuticals Holding
US Patent
LigandPNGBDBM444575(US10662186, Compound 94 | US10988476, Compound I-9...)
Affinity DataIC50:  1.37nM. Assay description: 1. Take 10 mM stock solution of the test compound, in 96-well compound plate, DMSO was used to dilute the compound to an initial concentration of 100...
Ligand InfoPC cidPC sid
In DepthDetails US Patent
TargetCyclin-dependent kinase 2(Homo sapiens (Human))
Shanghai Pharmaceuticals Holding
US Patent
LigandPNGBDBM444575(US10662186, Compound 94 | US10988476, Compound I-9...)
Affinity DataIC50:  10.3nM. Assay description: 1. Take 10 mM stock solution of the test compound, in 96-well compound plate, DMSO was used to dilute the compound to an initial concentration of 100...
Ligand InfoPC cidPC sid
In DepthDetails US Patent
TargetCyclin-dependent kinase 1(Homo sapiens (Human))
Shanghai Pharmaceuticals Holding
US Patent
LigandPNGBDBM444575(US10662186, Compound 94 | US10988476, Compound I-9...)
Affinity DataIC50:  264nM. Assay description: 1. Take 10 mM stock solution of the test compound, in 96-well compound plate, DMSO was used to dilute the compound to an initial concentration of 100...
Ligand InfoPC cidPC sid
In DepthDetails US Patent
TargetCyclin-dependent kinase 5(Homo sapiens (Human))
Shanghai Pharmaceuticals Holding
US Patent
LigandPNGBDBM444575(US10662186, Compound 94 | US10988476, Compound I-9...)
Affinity DataIC50:  67.3nM. Assay description: 1. Take 10 mM stock solution of the test compound, in 96-well compound plate, DMSO was used to dilute the compound to an initial concentration of 100...
Ligand InfoPC cidPC sid
In DepthDetails US Patent
TargetCyclin-dependent kinase 7(Homo sapiens (Human))
Shanghai Pharmaceuticals Holding
US Patent
LigandPNGBDBM444575(US10662186, Compound 94 | US10988476, Compound I-9...)
Affinity DataIC50:  66.2nM. Assay description: 1. Take 10 mM stock solution of the test compound, in 96-well compound plate, DMSO was used to dilute the compound to an initial concentration of 100...
Ligand InfoPC cidPC sid
In DepthDetails US Patent
TargetCyclin-dependent kinase 9(Homo sapiens (Human))
Shanghai Pharmaceuticals Holding
US Patent
LigandPNGBDBM444575(US10662186, Compound 94 | US10988476, Compound I-9...)
Affinity DataIC50:  13.5nM. Assay description: 1. Take 10 mM stock solution of the test compound, in 96-well compound plate, DMSO was used to dilute the compound to an initial concentration of 100...
Ligand InfoPC cidPC sid
In DepthDetails US Patent
TargetCyclin-dependent kinase 4(Homo sapiens (Human))
Shanghai Pharmaceuticals Holding
US Patent
LigandPNGBDBM444575(US10662186, Compound 94 | US10988476, Compound I-9...)
Affinity DataIC50:  1.16nM. Assay description: 1. Take 10 mM stock solution of the test compound, in 96-well compound plate, DMSO was used to dilute the compound to an initial concentration of 100...
Ligand InfoPC cidPC sid
In DepthDetails US Patent
TargetCyclin-dependent kinase 6(Homo sapiens (Human))
Shanghai Pharmaceuticals Holding
US Patent
LigandPNGBDBM444575(US10662186, Compound 94 | US10988476, Compound I-9...)
Affinity DataIC50:  1.37nM. Assay description: 1. Take 10 mM stock solution of the test compound, in 96-well compound plate, DMSO was used to dilute the compound to an initial concentration of 100...
Ligand InfoPC cidPC sid
In DepthDetails US Patent
TargetCyclin-dependent kinase 2(Homo sapiens (Human))
Shanghai Pharmaceuticals Holding
US Patent
LigandPNGBDBM444575(US10662186, Compound 94 | US10988476, Compound I-9...)
Affinity DataIC50:  10.3nM. Assay description: 1. Take 10 mM stock solution of the test compound, in 96-well compound plate, DMSO was used to dilute the compound to an initial concentration of 100...
Ligand InfoPC cidPC sid
In DepthDetails US Patent
TargetCyclin-dependent kinase 1(Homo sapiens (Human))
Shanghai Pharmaceuticals Holding
US Patent
LigandPNGBDBM444575(US10662186, Compound 94 | US10988476, Compound I-9...)
Affinity DataIC50:  264nM. Assay description: 1. Take 10 mM stock solution of the test compound, in 96-well compound plate, DMSO was used to dilute the compound to an initial concentration of 100...
Ligand InfoPC cidPC sid
In DepthDetails US Patent
TargetCyclin-dependent kinase 5(Homo sapiens (Human))
Shanghai Pharmaceuticals Holding
US Patent
LigandPNGBDBM444575(US10662186, Compound 94 | US10988476, Compound I-9...)
Affinity DataIC50:  67.3nM. Assay description: 1. Take 10 mM stock solution of the test compound, in 96-well compound plate, DMSO was used to dilute the compound to an initial concentration of 100...
Ligand InfoPC cidPC sid
In DepthDetails US Patent
TargetCyclin-dependent kinase 7(Homo sapiens (Human))
Shanghai Pharmaceuticals Holding
US Patent
LigandPNGBDBM444575(US10662186, Compound 94 | US10988476, Compound I-9...)
Affinity DataIC50:  66.2nM. Assay description: 1. Take 10 mM stock solution of the test compound, in 96-well compound plate, DMSO was used to dilute the compound to an initial concentration of 100...
Ligand InfoPC cidPC sid
In DepthDetails US Patent
TargetCyclin-dependent kinase 9(Homo sapiens (Human))
Shanghai Pharmaceuticals Holding
US Patent
LigandPNGBDBM444575(US10662186, Compound 94 | US10988476, Compound I-9...)
Affinity DataIC50:  13.5nM. Assay description: 1. Take 10 mM stock solution of the test compound, in 96-well compound plate, DMSO was used to dilute the compound to an initial concentration of 100...
Ligand InfoPC cidPC sid
In DepthDetails US Patent