BDBM444589 US10662186, Compound 112::US10662186, Compound 114
SMILES C[C@@H]1Cc2nc(Nc3ncc(F)c(n3)-c3cc(F)c4nc(C)n(c4c3)C(C)(C)C)ccc2CN1CCN(C)C
InChI Key InChIKey=XKPZMRRASYJBKC-QGZVFWFLSA-N
Data  10 IC50
  Tab Delimited (TSV)   2D SDfile   Computed 3D by Vconf -m prep SDfile
Find this compound or compounds like it in BindingDB:
Activity Spreadsheet -- Enzyme Inhibition Constant Data from BindingDB
Found 10 hits for monomerid = 444589
TargetCyclin-dependent kinase 4(Homo sapiens (Human))
Shanghai Pharmaceuticals Holding
US Patent
LigandPNGBDBM444589(US10662186, Compound 112 | US10662186, Compound 11...)
Affinity DataIC50:  1.37nM. Assay description: 1. Take 10 mM stock solution of the test compound, in 96-well compound plate, DMSO was used to dilute the compound to an initial concentration of 100...
Ligand InfoPC cidPC sid
In DepthDetails US Patent
TargetCyclin-dependent kinase 6(Homo sapiens (Human))
Shanghai Pharmaceuticals Holding
US Patent
LigandPNGBDBM444589(US10662186, Compound 112 | US10662186, Compound 11...)
Affinity DataIC50:  1.70nM. Assay description: 1. Take 10 mM stock solution of the test compound, in 96-well compound plate, DMSO was used to dilute the compound to an initial concentration of 100...
Ligand InfoPC cidPC sid
In DepthDetails US Patent
TargetCyclin-dependent kinase 2(Homo sapiens (Human))
Shanghai Pharmaceuticals Holding
US Patent
LigandPNGBDBM444589(US10662186, Compound 112 | US10662186, Compound 11...)
Affinity DataIC50:  44.9nM. Assay description: 1. Take 10 mM stock solution of the test compound, in 96-well compound plate, DMSO was used to dilute the compound to an initial concentration of 100...
Ligand InfoPC cidPC sid
In DepthDetails US Patent
TargetCyclin-dependent kinase 4(Homo sapiens (Human))
Shanghai Pharmaceuticals Holding
US Patent
LigandPNGBDBM444589(US10662186, Compound 112 | US10662186, Compound 11...)
Affinity DataIC50:  1.74nM. Assay description: 1. Take 10 mM stock solution of the test compound, in 96-well compound plate, DMSO was used to dilute the compound to an initial concentration of 100...
Ligand InfoPC cidPC sid
In DepthDetails US Patent
TargetCyclin-dependent kinase 9(Homo sapiens (Human))
Shanghai Pharmaceuticals Holding
US Patent
LigandPNGBDBM444589(US10662186, Compound 112 | US10662186, Compound 11...)
Affinity DataIC50:  15.3nM. Assay description: 1. Take 10 mM stock solution of the test compound, in 96-well compound plate, DMSO was used to dilute the compound to an initial concentration of 100...
Ligand InfoPC cidPC sid
In DepthDetails US Patent
TargetCyclin-dependent kinase 2(Homo sapiens (Human))
Shanghai Pharmaceuticals Holding
US Patent
LigandPNGBDBM444589(US10662186, Compound 112 | US10662186, Compound 11...)
Affinity DataIC50:  23.6nM. Assay description: 1. Take 10 mM stock solution of the test compound, in 96-well compound plate, DMSO was used to dilute the compound to an initial concentration of 100...
Ligand InfoPC cidPC sid
In DepthDetails US Patent
TargetCyclin-dependent kinase 1(Homo sapiens (Human))
Shanghai Pharmaceuticals Holding
US Patent
LigandPNGBDBM444589(US10662186, Compound 112 | US10662186, Compound 11...)
Affinity DataIC50:  161nM. Assay description: 1. Take 10 mM stock solution of the test compound, in 96-well compound plate, DMSO was used to dilute the compound to an initial concentration of 100...
Ligand InfoPC cidPC sid
In DepthDetails US Patent
TargetCyclin-dependent kinase 5(Homo sapiens (Human))
Shanghai Pharmaceuticals Holding
US Patent
LigandPNGBDBM444589(US10662186, Compound 112 | US10662186, Compound 11...)
Affinity DataIC50:  14.6nM. Assay description: 1. Take 10 mM stock solution of the test compound, in 96-well compound plate, DMSO was used to dilute the compound to an initial concentration of 100...
Ligand InfoPC cidPC sid
In DepthDetails US Patent
TargetCyclin-dependent kinase 7(Homo sapiens (Human))
Shanghai Pharmaceuticals Holding
US Patent
LigandPNGBDBM444589(US10662186, Compound 112 | US10662186, Compound 11...)
Affinity DataIC50:  195nM. Assay description: 1. Take 10 mM stock solution of the test compound, in 96-well compound plate, DMSO was used to dilute the compound to an initial concentration of 100...
Ligand InfoPC cidPC sid
In DepthDetails US Patent
TargetCyclin-dependent kinase 6(Homo sapiens (Human))
Shanghai Pharmaceuticals Holding
US Patent
LigandPNGBDBM444589(US10662186, Compound 112 | US10662186, Compound 11...)
Affinity DataIC50:  1.77nM. Assay description: 1. Take 10 mM stock solution of the test compound, in 96-well compound plate, DMSO was used to dilute the compound to an initial concentration of 100...
Ligand InfoPC cidPC sid
In DepthDetails US Patent